{"text_format":"1","workbook":"xlsx","n_sheets":9,"sheets":["Menu Prin.","2.Pré. Eq","Eq.PS","Eq.Ray","Eq.Adéq","Eq.Visibilité","Manuel d'utilisation","Feuil2","Feuille Excel"],"not_rendered":{"charts":0,"images":1,"macros":1,"external_links":0,"defined_names":97,"comments":0,"pivot_tables":0},"unopened":[],"bounds":{"document_bytes":16777216,"sheet_cells":100000,"rows_first":2000,"rows_last":500,"rows_between":2000,"halvings":0,"cell_chars":16384,"cell_head_chars":4096},"cells_cut":0,"cells_raw":0,"read":"whole","date_system":"1900"}

{"sheet":"Menu Prin.","index":0,"n_rows":2,"n_cols":2,"rows_kept":2,"cut":false,"hidden":false,"merged":[[1,1,1,16],[2,1,2,16],[0,1,0,16]]}
[null,"Ministère de l’Enseignement Supérieur et de la Recherche Scientifique"]
[null,"Direction Générale de la Recherche Scientifique et du Développement Technologique"]

{"sheet":"2.Pré. Eq","index":1,"n_rows":122,"n_cols":54,"rows_kept":122,"cut":false,"hidden":false,"merged":[[14,39,14,40],[15,9,15,20],[15,22,15,37],[27,3,27,11],[32,26,32,41],[34,22,34,24],[34,13,35,14],[34,16,35,16],[30,22,30,31],[30,33,30,40],[27,13,27,20],[28,13,28,20],[28,22,28,31],[34,30,34,31],[34,7,35,9],[34,39,34,40],[28,3,28,11],[23,3,23,7],[30,3,30,11],[23,9,23,20],[23,22,23,37],[15,3,15,7],[15,39,15,40],[27,22,27,31],[0,33,0,44],[0,1,0,31],[1,34,1,37],[4,34,4,37],[2,34,2,37],[1,39,2,40],[13,39,13,40],[11,9,11,37],[12,39,12,40],[13,16,13,20],[13,22,13,28],[13,30,13,37],[4,39,5,39],[5,34,5,37],[7,2,7,22],[7,24,7,41],[9,3,9,7],[9,39,9,40],[13,3,13,7],[9,9,9,37],[13,9,13,14],[11,3,11,7],[11,39,11,40],[116,24,116,28],[38,22,38,24],[37,30,37,31],[39,22,39,24],[41,39,41,40],[40,39,40,40],[40,36,40,37],[40,33,40,34],[40,13,40,14],[69,26,69,41],[71,3,84,40],[98,2,98,23],[98,24,98,41],[88,3,96,40],[46,3,56,40],[60,3,67,40],[39,7,39,9],[40,22,40,24],[116,3,116,7],[110,5,110,11],[111,5,111,11],[114,5,114,11],[114,36,114,40],[113,26,113,34],[17,2,17,22],[19,39,19,40],[21,39,21,40],[17,24,17,41],[19,3,19,7],[19,9,19,37],[21,3,21,7],[21,30,21,37],[21,16,21,20],[21,22,21,28],[21,9,21,14],[27,33,27,40],[23,39,23,40],[25,2,25,28],[25,29,25,41],[28,33,28,40],[30,13,30,20],[35,39,35,40],[38,30,38,31],[37,36,37,37],[38,7,38,9],[37,7,37,9],[37,39,37,40],[38,39,38,40],[32,2,32,20],[114,26,114,34],[110,13,110,24],[111,13,111,24],[112,13,112,24],[113,13,113,24],[114,13,114,24],[110,36,110,40],[111,36,111,40],[39,33,39,34],[39,30,39,31],[112,36,112,40],[109,26,109,34],[110,26,110,34],[111,26,111,34],[112,26,112,34],[109,36,109,40],[39,36,39,37],[42,39,42,40],[113,36,113,40],[117,24,122,39],[34,5,35,5],[37,13,37,14],[34,33,34,34],[34,36,34,37],[38,33,38,34],[37,33,37,34],[34,11,35,11],[41,7,41,9],[41,13,41,14],[41,22,41,24],[41,30,41,31],[41,33,41,34],[41,36,41,37],[38,13,38,14],[39,13,39,14],[38,36,38,37],[35,22,35,24],[35,30,35,31],[35,33,35,34],[35,36,35,37],[34,18,35,18],[39,39,39,40],[109,5,109,11],[113,5,113,11],[100,3,102,40],[44,2,44,25],[44,26,44,41],[58,2,58,25],[58,26,58,41],[106,13,106,24],[106,26,106,34],[106,36,106,40],[86,2,86,23],[86,24,86,41],[69,2,69,25],[112,5,112,11],[104,2,104,23],[104,24,104,41],[109,13,109,24],[107,26,107,34],[107,36,107,40],[107,13,107,24],[106,5,106,11],[107,5,107,11],[40,7,40,9],[37,22,37,24],[40,30,40,31],[42,7,42,9],[42,13,42,14],[42,22,42,24],[42,30,42,31],[42,33,42,34],[42,36,42,37]]}
["cc","1. Identification et présentation de l'Equipe de recherche",null,null,null,null,null,null,null,null,null,null,null,null,null,null,null,null,null,null,null,null,null,null,null,null,null,null,null,null,null,null,null,"1. تعريف و تقديم فرقة البحث"]
[null,null,null,null,null,null,null,null,null,null,null,null,null,null,null,null,null,null,null,null,null,null,null,null,null,null,null,null,null,null,null,null,null,null,"رمزالفرقة"]
[null,null,null,null,null,null,null,null,null,null,null,null,null,null,null,null,null,null,null,null,null,null,null,null,null,null,null,null,null,null,null,null,null,null,"Code de l'équipe"]
[]
[null,null,null,null,null,null,null,null,null,null,null,null,null,null,null,null,null,null,null,null,null,null,null,null,null,null,null,null,null,null,null,null,null,null,"رقم الفرقة"]
[null,null,null,null,null,null,null,null,null,null,null,null,null,null,null,null,null,null,null,null,null,null,null,null,null,null,null,null,null,null,null,null,null,null,"N° de l'équipe"]
[]
[null,null,"     Identification du Laboratoire",null,null,null,null,null,null,null,null,null,null,null,null,null,null,null,null,null,null,null,null,null,"    التعريف بالمخبر    "]
[]
[null,null,null,"    Etablissement de rattachement",null,null,null,null,":",null,null,null,null,null,null,null,null,null,null,null,null,null,null,null,null,null,null,null,null,null,null,null,null,null,null,null,null,null,":","مؤسسة الالحاق",null,null,null,null,null,null,null,{"$f":"IF(J10=\"\",\"listevide\",SUBSTITUTE(J10,\" \",\"_\"))","v":"listevide"}]
[]
[null,null,null,"    Intitulé du Laboratoire ",null,null,null,null,":",null,null,null,null,null,null,null,null,null,null,null,null,null,null,null,null,null,null,null,null,null,null,null,null,null,null,null,null,null,":","اسم المخبر"]
[]
[null,null,null,"    Acronyme du Laboratoire",null,null,null,null,":",null,null,null,null,null,null,null," الاسم المختزل للمخبر ",null,null,null,null,null,"  Site Web ou URL de laboratoire",null,null,null,null,null,null,null,null,null,null,null,null,null,null,null,":","العنوان الالكتروني للمخبر"]
[]
[null,null,null,"     Nom et Prénom du Directeur",null,null,null,null,":",null,null,null,null,null,null,null,null,null,null,null,null,null,null,null,null,null,null,null,null,null,null,null,null,null,null,null,null,null,":","لقب و اسم المدير"]
[]
[null,null,"    Identification de l'équipe",null,null,null,null,null,null,null,null,null,null,null,null,null,null,null,null,null,null,null,null,null,"    التعريف بالفرقة"]
[]
[null,null,null,"     Intitulé de l'équipe",null,null,null,null,":",null,null,null,null,null,null,null,null,null,null,null,null,null,null,null,null,null,null,null,null,null,null,null,null,null,null,null,null,null,":"," اسم الفرقة "]
[]
[null,null,null,"      Acronyme de l'équipe",null,null,null,null,":",null,null,null,null,null,null,null,"الاسم المختزل للفرقة ",null,null,null,null,null,"  Site Web ou URL de l'équipe (obligatoire)",null,null,null,null,null,null,null,null,null,null,null,null,null,null,null,":"," العنوان الالكتروني (إجباري)"]
[]
[null,null,null,"       Nom et  prénom du chef d'équipe",null,null,null,null,":",null,null,null,null,null,null,null,null,null,null,null,null,null,null,null,null,null,null,null,null,null,null,null,null,null,null,null,null,null,":"," لقب و اسم مدير الفرقة "]
[]
[null,null,"    Classement thématique de l'équipe",null,null,null,null,null,null,null,null,null,null,null,null,null,null,null,null,null,null,null,null,null,null,null,null,null,null,"    التصنيف الموضوعاتي للفرقة "]
[]
[null,null,null,"الميدان الأساسي",null,null,null,null,null,null,null,null,null,"الميدان الجزئي 1",null,null,null,null,null,null,null,null,"الميدان الجزئي 2",null,null,null,null,null,null,null,null,null,null,"الميدان الجزئي 3"]
[null,null,null,"Grand Domaine",null,null,null,null,null,null,null,null,null,"Micro Domaine 1",null,null,null,null,null,null,null,null,"Micro Domaine 2",null,null,null,null,null,null,null,null,null,null,"Micro Domaine 3"]
[]
[null,null,null,null,null,null,null,null,null,null,null,null,null,null,null,null,null,null,null,null,null,null,null,null,null,null,null,null,null,null,null,null,null,null,null,null,null,null,null,null,null,null,{"$f":"OR(D31=\"Sciences humaines et arts\", D31=\"Psychologie et sciences cognitives\",D31=\"Sciences sociales\")","v":false},{"$f":"IF(AQ31=TRUE,\"MD_SHS\",IF(D31=\"\",\"listevide\",\"MD_ST\"))","v":"listevide"},null,null,null,null,null,{"$f":"OR(D31=\"GD8: Sciences humaines et arts\", D31=\"\",D31=\"GD7: Sciences sociales\")","v":true},{"$f":"IF(AX31=FALSE,\"MD_ST\",IF(D31=\"\",\"listevide\",IF(D31=\"GD8: Sciences humaines et arts\",\"MD_SH\",\"MD_SS\")))","v":"listevide"}]
[]
[null,null,"    Liste exhaustive des membres de l’équipe par grade (dont les Doctorant, LMD et autres)",null,null,null,null,null,null,null,null,null,null,null,null,null,null,null,null,null,null,null,null,null,null,null,"    القائمة المفصلة لأعضاء الفرقة (طلبة الدكتوراه، نظام LMD ،..........الخ)"]
[]
[null,null,null,"الجنس",null,"Nom à la naissance",null," Épouse de",null,null,null,"Prénom",null,"اللقب عند الميلاد",null,null,"زوجة",null,"الاسم",null,"تاريخ الميلاد",null,"الشهادة الأخيرة",null,null,null,"الرتبة",null,"الميدان الرئيسي",null,"مؤسسة الالحاق",null,null,"مسجل منذ",null,null,"جامعة",null,null,"لقب وإسم المؤطر أو المؤطرين"]
[null,null,null,"Sexe",null,null,null,null,null,null,null,null,null,null,null,null,null,null,null,null,"Date de Nais.",null,"Dernier diplôme",null,null,null,"Grade",null,"Domaine principal",null,"Structure de rattachement",null,null,"Inscrit depuis",null,null,"A l’Univ.",null,null,"Nom & prénom du ou des encadreurs"]
[]
[null,null,null,null,null,null,null,null,null,null,null,null,null,null,null,null,null,null,null,null,null,null,null,null,null,null,null,"  "]
[null,null,null,null,null,null,null,null,null,null,null,null,null,null,null,null,null,null,null,null,null,null,null,null,null,null,null,"  "]
[null,null,null,null,null,null,null,null,null,null,null,null,null,null,null,null,null,null,null,null,null,null,null,null,null,null,null,"  "]
[null,null,null,null,null,null,null,null,null,null,null,null,null,null,null,null,null,null,null,null,null,null,null,null,null,null,null,"  "]
[null,null,null,null,null,null,null,null,null,null,null,null,null,null,null,null,null,null,null,null,null,null,null,null,null,null,null,"  "]
[null,null,null,null,null,null,null,null,null,null,null,null,null,null,null,null,null,null,null,null,null,null,null,null,null,null,null,"  ",null,null,null,null,null,null,null,null,null,null,null,null,null,null,null,null,null,null,null,null,null,null,null,null,null,"cc"]
[]
[null,null,"    Description  scientifique du programme de recherche de l’équipe (100 - 300 mots)",null,null,null,null,null,null,null,null,null,null,null,null,null,null,null,null,null,null,null,null,null,null,null,"    وصف علمي لبرنامج بحث الفرقة (100 - 300  كلمة)"]
[]
[]
[]
[]
[]
[]
[]
[]
[]
[]
[]
[]
[]
[null,null,"     Adéquation entre le programme initial de l’équipe et sa réalisation (50 - 100 mots)",null,null,null,null,null,null,null,null,null,null,null,null,null,null,null,null,null,null,null,null,null,null,null,"    التطابق بين البرنامج الأولي للفرقة و إنجازه (50 - 100  كلمة)"]
[]
[]
[]
[]
[]
[]
[]
[]
[]
[]
[null,null,"    Environnement et contraintes (50 - 200 mots)",null,null,null,null,null,null,null,null,null,null,null,null,null,null,null,null,null,null,null,null,null,null,null,"    محيط و صعوبات (50 - 200  كلمة)"]
[]
[]
[]
[]
[]
[]
[]
[]
[]
[]
[]
[]
[]
[]
[]
[]
[null,null,"    Travaux en cours (>  100 mots)",null,null,null,null,null,null,null,null,null,null,null,null,null,null,null,null,null,null,null,null,null,"    أعمال قيد الانجاز (>100  كلمة)"]
[]
[]
[]
[]
[]
[]
[]
[]
[]
[]
[]
[null,null,"    Quelques indicateurs",null,null,null,null,null,null,null,null,null,null,null,null,null,null,null,null,null,null,null,null,null,"    بعض المؤشرات"]
[]
[]
[]
[]
[]
[null,null,"    Compléments d’information",null,null,null,null,null,null,null,null,null,null,null,null,null,null,null,null,null,null,null,null,null,"    معلومات إضافية"]
[]
[null,null,null,"رقم",null,"اللقب و الاسم (حسب الرتبة)",null,null,null,null,null,null,null,"البريد الالكتروني 1",null,null,null,null,null,null,null,null,null,null,null,null,"البريد الالكتروني 2",null,null,null,null,null,null,null,null,null,"الهاتف"]
[null,null,null,"N°",null,"Nom & Prénom   (par grade) ",null,null,null,null,null,null,null,"Courriel professionnel",null,null,null,null,null,null,null,null,null,null,null,null,"Courriel personnel",null,null,null,null,null,null,null,null,null,"Téléphone"]
[]
[null,null,null,1,null,{"$f":"IF(F38=\"\",\"\",CONCATENATE(F38,L38))","v":""}]
[null,null,null,2,null,{"$f":"IF(F39=\"\",\"\",CONCATENATE(F39,L39))","v":""}]
[null,null,null,3,null,""]
[null,null,null,4,null,""]
[null,null,null,5,null,""]
[null,null,null,6,null,"",null,null,null,null,null,null,null,null,null,null,null,null,null,null,null,null,null,null,null,null,null,null,null,null,null,null,null,null,null,null,null,null,null,null,null,null,null,null,null,null,"cc"]
[]
[null,null,null,"Remarques",null,null,null,null,null,null,null,null,null,null,null,null,null,null,null,null,null,null,null,null,"Observation(libre)"]
[null,null,null,{"$f":"traitementcomptermotrange(D47)","v":0},null,{"$f":"IF(AND(D118<100, D118<>0),\"La description  scientifique du programme de recherche de l’équipe est insuffisante\",IF(D118>300,\"la description scientifique du programme de recherche de l’équipe est longue\",\"\"))","v":""}]
[null,null,null,{"$f":"traitementcomptermotrange(D61)","v":0},null,{"$f":"IF(AND(D119<50, D119<>0),\"L'adéquation entre le programme initial de l’équipe et sa réalisation est insuffisante\",IF(D119>100,\"L'adéquation entre le programme initial de l’équipe et sa réalisation est longue\",\"\"))","v":""}]
[null,null,null,{"$f":"traitementcomptermotrange(D72)","v":0},null,{"$f":"IF(AND(D120<50, D120<>0),\"Environnement et contraintes est insuffisant\",IF(D120>200,\" Environnement et contraintes est long\",\"\"))","v":""}]
[null,null,null,{"$f":"traitementcomptermotrange(D89)","v":0},null,{"$f":"IF(AND(D121<100, D121<>0),\"Les travaux en cours sont insuffisants\",\"\")","v":""}]
[null,null,null,{"$f":"traitementcomptermotrange(D101)","v":0}]

{"sheet":"Eq.PS","index":2,"n_rows":180,"n_cols":68,"rows_kept":180,"cut":false,"hidden":false,"merged":[[100,36,100,37],[153,2,153,17],[153,26,153,37],[164,36,164,37],[155,36,155,37],[155,2,155,12],[155,26,155,35],[164,2,164,12],[164,26,164,35],[117,36,117,37],[108,36,108,37],[108,2,108,12],[108,26,108,35],[117,2,117,12],[147,26,147,35],[147,36,147,37],[141,36,141,37],[135,36,135,37],[129,36,129,37],[123,36,123,37],[129,2,129,12],[129,26,129,35],[135,2,135,12],[126,22,126,30],[90,13,90,20],[91,13,91,20],[92,13,92,20],[96,13,96,20],[117,26,117,35],[123,2,123,12],[103,7,103,9],[104,7,104,9],[102,13,102,20],[103,13,103,20],[104,13,104,20],[110,13,110,20],[111,13,111,20],[102,22,102,26],[102,29,102,30],[115,13,115,20],[100,2,100,12],[100,26,100,35],[97,13,97,20],[96,22,96,26],[97,22,97,26],[103,22,103,26],[103,29,103,30],[98,22,98,26],[64,36,64,37],[58,36,58,37],[76,36,76,37],[82,36,82,37],[70,36,70,37],[64,26,64,35],[70,2,70,12],[58,2,58,12],[58,26,58,35],[64,2,64,12],[76,2,76,12],[79,13,79,20],[80,13,80,20],[72,13,72,20],[73,13,73,20],[74,13,74,20],[78,13,78,20],[74,22,74,26],[60,13,60,20],[68,13,68,20],[68,22,68,26],[68,29,68,30],[66,13,66,20],[67,13,67,20],[94,36,94,37],[98,13,98,20],[96,29,96,30],[97,29,97,30],[0,1,0,20],[29,2,29,12],[29,26,29,35],[25,29,25,30],[26,29,26,30],[27,29,27,30],[38,29,38,30],[39,29,39,30],[37,29,37,30],[35,2,35,12],[35,26,35,35],[2,2,2,12],[1,2,1,19],[33,29,33,30],[32,29,32,30],[31,29,31,30],[21,29,21,30],[20,29,20,30],[15,29,15,30],[88,36,88,37],[49,36,49,37],[35,36,35,37],[41,36,41,37],[41,2,41,12],[41,26,41,35],[49,2,49,12],[49,26,49,35],[4,21,4,22],[5,21,5,22],[43,29,43,30],[44,29,44,30],[45,29,45,30],[47,2,47,17],[47,26,47,37],[17,2,17,12],[17,26,17,35],[23,2,23,12],[23,26,23,35],[11,2,11,12],[23,36,23,37],[17,36,17,37],[19,29,19,30],[29,36,29,37],[5,24,5,25],[7,24,7,25],[13,24,13,25],[14,24,14,25],[4,29,4,30],[5,29,5,30],[13,29,13,30],[14,29,14,30],[0,22,0,38],[11,36,11,37],[1,26,1,37],[2,36,2,37],[7,29,7,30],[2,26,2,35],[11,26,11,35],[7,21,7,22],[13,21,13,22],[14,21,14,22],[4,24,4,25],[8,21,8,22],[8,24,8,25],[8,29,8,30],[9,21,9,22],[9,24,9,25],[9,29,9,30],[38,24,38,25],[39,24,39,25],[43,24,43,25],[15,21,15,22],[19,21,19,22],[20,21,20,22],[21,21,21,22],[25,21,25,22],[26,21,26,22],[27,21,27,22],[31,21,31,22],[32,21,32,22],[33,21,33,22],[37,21,37,22],[38,21,38,22],[39,21,39,22],[15,24,15,25],[19,24,19,25],[20,24,20,25],[21,24,21,25],[25,24,25,25],[26,24,26,25],[27,24,27,25],[31,24,31,25],[66,22,66,26],[43,21,43,22],[44,21,44,22],[45,21,45,22],[51,13,51,20],[52,13,52,20],[54,13,54,20],[55,13,55,20],[56,13,56,20],[51,22,51,26],[61,13,61,20],[61,22,61,26],[54,22,54,26],[55,22,55,26],[56,22,56,26],[62,13,62,20],[60,22,60,26],[85,22,85,26],[123,26,123,35],[73,29,73,30],[66,29,66,30],[67,22,67,26],[67,29,67,30],[72,22,72,26],[72,29,72,30],[73,22,73,26],[70,22,70,35],[74,29,74,30],[78,22,78,26],[78,29,78,30],[79,22,79,26],[79,29,79,30],[80,22,80,26],[80,29,80,30],[84,22,84,26],[84,29,84,30],[76,22,76,34],[82,22,82,35],[86,22,86,26],[86,29,86,30],[106,26,106,37],[177,3,177,16],[178,3,178,16],[179,3,179,16],[174,17,174,21],[91,29,91,30],[92,22,92,26],[92,29,92,30],[137,13,137,20],[137,22,137,30],[138,13,138,20],[138,22,138,30],[139,13,139,20],[139,22,139,30],[135,26,135,35],[104,22,104,26],[104,29,104,30],[114,22,114,30],[115,22,115,30],[119,13,119,20],[119,22,119,30],[114,13,114,20],[158,25,158,32],[119,7,119,9],[174,3,174,12],[179,17,179,21],[160,17,160,23],[161,17,161,23],[162,17,162,23],[177,22,177,36],[178,22,178,36],[177,17,177,21],[178,17,178,21],[167,17,167,23],[167,25,167,32],[168,17,168,23],[168,25,168,32],[179,22,179,36],[174,22,174,36],[175,22,175,36],[176,22,176,36],[171,32,172,37],[133,13,133,20],[133,22,133,30],[120,13,120,20],[111,22,111,30],[113,13,113,20],[113,22,113,30],[121,22,121,30],[162,25,162,32],[131,13,131,20],[131,22,131,30],[125,13,125,20],[125,22,125,30],[126,13,126,20],[127,13,127,20],[127,22,127,30],[120,22,120,30],[132,13,132,20],[121,13,121,20],[110,7,110,9],[111,7,111,9],[113,7,113,9],[114,7,114,9],[115,7,115,9],[175,17,175,21],[176,17,176,21],[175,3,175,16],[176,3,176,16],[166,17,166,23],[137,7,137,9],[138,7,138,9],[133,7,133,9],[120,7,120,9],[121,7,121,9],[125,7,125,9],[126,7,126,9],[127,7,127,9],[131,7,131,9],[132,7,132,9],[110,22,110,30],[139,7,139,9],[143,7,143,9],[132,22,132,30],[4,18,5,18],[4,20,5,20],[4,23,5,23],[4,26,5,26],[44,24,44,25],[45,24,45,25],[143,13,143,20],[143,22,143,30],[54,29,54,30],[55,29,55,30],[56,29,56,30],[60,29,60,30],[94,22,94,35],[90,22,90,26],[90,29,90,30],[91,22,91,26],[85,29,85,30],[61,29,61,30],[62,22,62,26],[62,29,62,30],[84,13,84,20],[85,13,85,20],[141,26,141,35],[86,13,86,20],[88,22,88,34],[32,24,32,25],[51,29,51,30],[52,22,52,26],[52,29,52,30],[33,24,33,25],[37,24,37,25],[161,25,161,32],[145,13,145,20],[145,22,145,30],[149,13,149,20],[149,22,149,30],[150,13,150,20],[150,22,150,30],[158,17,158,23],[157,25,157,32],[151,13,151,20],[151,22,151,30],[157,17,157,23],[160,25,160,32],[144,13,144,20],[144,22,144,30],[98,29,98,30],[106,2,106,17],[51,7,51,9],[52,7,52,9],[54,7,54,9],[55,7,55,9],[56,7,56,9],[60,7,60,9],[61,7,61,9],[62,7,62,9],[66,7,66,9],[67,7,67,9],[68,7,68,9],[72,7,72,9],[73,7,73,9],[74,7,74,9],[78,7,78,9],[79,7,79,9],[80,7,80,9],[84,7,84,9],[82,2,82,12],[85,7,85,9],[86,7,86,9],[90,7,90,9],[91,7,91,9],[92,7,92,9],[96,7,96,9],[97,7,97,9],[98,7,98,9],[102,7,102,9],[94,2,94,12],[88,2,88,12],[141,2,141,12],[144,7,144,9],[145,7,145,9],[149,7,149,9],[150,7,150,9],[151,7,151,9],[157,13,157,15],[157,7,157,11],[158,7,158,11],[158,13,158,15],[147,2,147,12],[171,2,172,6],[166,25,166,32],[168,7,168,11],[168,13,168,15],[160,13,160,15],[161,13,161,15],[162,13,162,15],[160,7,160,11],[161,7,161,11],[162,7,162,11],[166,7,166,11],[166,13,166,15],[167,7,167,11],[167,13,167,15]]}
[{"$f":"CONCATENATE(\"Equipe\",\" \",'2.Pré. Eq'!AN5)","v":"Equipe "},"2. Production scientifique",null,null,null,null,null,null,null,null,null,null,null,null,null,null,null,null,null,null,null,null,"2. الإنتاج العلمي",null,null,null,null,null,null,null,null,null,null,null,null,null,null,null,null,{"$f":"CONCATENATE(\"فرقة\",\" \",'2.Pré. Eq'!AN5)","v":"فرقة "}]
[null,null,"a) Publications dans des revues",null,null,null,null,null,null,null,null,null,null,null,null,null,null,null,null,null,null,null,null,null,null,null,"أ) النشر في المجلات "]
[null,null,"  Publications dans la catégorie exceptionnelle",null,null,null,null,null,null,null,null,null,null,null,null,null,null,"Exp",null,null,null,null,null,null,null,null,"الإصدار ضمن الصنف الاستثنائي",null,null,null,null,null,null,null,null,null,"500 pts/نقطة",null,null,null,null,"ordre G D ","Val G Domaine","Val Saisi"]
[]
[null,null,null,"رقم",null,"ر دمك",null,"اسم المجلة",null,"حدّد المقال (عنوان؛رقم وصفحات)",null,"السنة",null,"عدد لمؤلفين",null,"ترتيب المؤلفون",null,"المؤلف الأوّل","M","المؤلف الثاني","M","المؤلفين من 3 الي (n-1)",null,"Nbre M","المؤلف الأخير",null,"M",null,null,"حصة المؤلفين",null,null,"المؤلفون- DZ",null,"مؤشر التعاون",null,"القيمة",null,null,null,null,{"$f":"IF(AQ5>6,\"Non\",IF(AQ5=5,\"Non\",IF(AQ5=0,\"vide\",\"Oui\")))","v":"vide"},{"$f":"IF('2.Pré. Eq'!D31=\"\",0,((VALUE(RIGHT(LEFT('2.Pré. Eq'!D31,3),1)))))","v":0},{"$f":"IF(P8=\"oui\",1,IF(P8=\"\",\"vide\",0))","v":"vide"}]
[null,null,null,"N°",null,"ISSN",null,"Nom de la revue",null,"Préciser l’article (Titre,numéro  et pages)",null,"Année",null,"# auteurs",null,"O-A ",null,"1 er Auteur",null,"2 éme Auteur",null,"Les Auteurs de 3 à n-1",null,null,"Dernier Auteur",null,null,null,null,"Part des A",null,null,"A-DZ",null,"Ind. Coll",null,"Valeur"]
[null,null,null,null,null,null,null,null,null,null,null,null,null,null,null,null,null,null,null,null,null,null,null,null,null,null,null,null,null,null,null,null,null,null,null,null,null,null,null,null,null,{"$f":"IF(ISERROR(SEARCH(\"pts/نقطة\",AK7)),\"\",\"0\")","v":""}]
[null,null,null,1,null,null,null,null,null,null,null,null,null,null,null,null,null,null,null,null,null,null,null,null,null,null,null,null,null,{"$f":"IF(OR(N8=\"\",$AP$5=\"vide\"),\"\",IF(OR($AP$5=P8,P8=\"\"),IF(N8=1,1,IF(N8=2,IF($AP$5=\"Non\",0.6*S8+0.6*U8,0.75*S8+0.45*U8),IF(N8=3,IF($AP$5=\"Non\",0.4*S8+0.4*U8+0.4*AA8,0.6*S8+0.3*U8+0.3*AA8),IF($AP$5=\"Non\",((S8+U8+X8+AA8)*1.2)/N8,0.5*S8+0.2*U8+(0.25*X8)/(N8-3)+0.25*AA8)))),IF(N8=1,1,IF(N8=2,IF(P8=\"Non\",0.6*S8+0.6*U8,0.75*S8+0.45*U8),IF(N8=3,IF(P8=\"Non\",0.4*S8+0.4*U8+0.4*AA8,0.6*S8+0.3*U8+0.3*AA8),IF(P8=\"Non\",((S8+U8+X8+AA8)*1.2)/N8,0.5*S8+0.2*U8+(0.25*X8)/(N8-3)+0.25*AA8))))))","v":""},null,null,null,null,{"$f":"IF(N8=0,\"\",IF(N8=1,\"100%\",\"120%\"))","v":""},null,{"$f":"IF(AD8=\"\",\"\",IF(AG8=\"Oui\",AD8*1.5*500,AD8*500))","v":""},null,null,null,null,{"$f":"IF(OR(AK8=\"Valeur\",AK8=\"القيمة\"),0,IF(ISERROR(SEARCH(\"/\",AK8)),AK8,0))","v":""}]
[null,null,null,2,null,null,null,null,null,null,null,null,null,null,null,null,null,null,null,null,null,null,null,null,null,null,null,null,null,{"$f":"IF(OR(N9=\"\",$AP$5=\"vide\"),\"\",IF(OR($AP$5=P9,P9=\"\"),IF(N9=1,1,IF(N9=2,IF($AP$5=\"Non\",0.6*S9+0.6*U9,0.75*S9+0.45*U9),IF(N9=3,IF($AP$5=\"Non\",0.4*S9+0.4*U9+0.4*AA9,0.6*S9+0.3*U9+0.3*AA9),IF($AP$5=\"Non\",((S9+U9+X9+AA9)*1.2)/N9,0.5*S9+0.2*U9+(0.25*X9)/(N9-3)+0.25*AA9)))),IF(N9=1,1,IF(N9=2,IF(P9=\"Non\",0.6*S9+0.6*U9,0.75*S9+0.45*U9),IF(N9=3,IF(P9=\"Non\",0.4*S9+0.4*U9+0.4*AA9,0.6*S9+0.3*U9+0.3*AA9),IF(P9=\"Non\",((S9+U9+X9+AA9)*1.2)/N9,0.5*S9+0.2*U9+(0.25*X9)/(N9-3)+0.25*AA9))))))","v":""},null,null,null,null,{"$f":"IF(N9=0,\"\",IF(N9=1,\"100%\",\"120%\"))","v":""},null,{"$f":"IF(AD9=\"\",\"\",IF(AG9=\"Oui\",AD9*1.5*500,AD9*500))","v":""},null,null,null,null,{"$f":"IF(OR(AK9=\"Valeur\",AK9=\"القيمة\"),0,IF(ISERROR(SEARCH(\"/\",AK9)),AK9,0))","v":""}]
[null,null,null,3,null,null,null,null,null,null,null,null,null,null,null,null,null,null,null,null,null,null,null,null,null,null,null,null,null,"",null,null,null,null,"",null,"",null,null,null,null,"",1]
[null,null,null,null,null,null,null,null,null,null,null,null,null,null,null,null,null,null,null,null,null,null,null,null,null,null,null,null,null,null,null,null,null,null,null,null,null,null,null,null,null,0]
[null,null,"Publication dans la catégorie",null,null,null,null,null,null,null,null,null,null,null,null,null,null,"A+",null,null,null,null,null,null,null,null,"الإصدار ضمن الصنف",null,null,null,null,null,null,null,null,null,"100 pts/نقطة",null,null,null,null,0]
[null,null,null,null,null,null,null,null,null,null,null,null,null,null,null,null,null,null,null,null,null,null,null,null,null,null,null,null,null,null,null,null,null,null,null,null,null,null,null,null,null,0]
[null,null,null,1,null,null,null,null,null,null,null,null,null,null,null,null,null,null,null,null,null,null,null,null,null,null,null,null,null,{"$f":"IF(OR(N14=\"\",$AP$5=\"vide\"),\"\",IF(OR($AP$5=P14,P14=\"\"),IF(N14=1,1,IF(N14=2,IF($AP$5=\"Non\",0.6*S14+0.6*U14,0.75*S14+0.45*U14),IF(N14=3,IF($AP$5=\"Non\",0.4*S14+0.4*U14+0.4*AA14,0.6*S14+0.3*U14+0.3*AA14),IF($AP$5=\"Non\",((S14+U14+X14+AA14)*1.2)/N14,0.5*S14+0.2*U14+(0.25*X14)/(N14-3)+0.25*AA14)))),IF(N14=1,1,IF(N14=2,IF(P14=\"Non\",0.6*S14+0.6*U14,0.75*S14+0.45*U14),IF(N14=3,IF(P14=\"Non\",0.4*S14+0.4*U14+0.4*AA14,0.6*S14+0.3*U14+0.3*AA14),IF(P14=\"Non\",((S14+U14+X14+AA14)*1.2)/N14,0.5*S14+0.2*U14+(0.25*X14)/(N14-3)+0.25*AA14))))))","v":""},null,null,null,null,{"$f":"IF(N14=0,\"\",IF(N14=1,\"100%\",\"120%\"))","v":""},null,{"$f":"IF(AD14=\"\",\"\",IF(AG14=\"Oui\",AD14*1.5*500,AD14*100))","v":""},null,null,null,null,""]
[null,null,null,2,null,null,null,null,null,null,null,null,null,null,null,null,null,null,null,null,null,null,null,null,null,null,null,null,null,{"$f":"IF(OR(N15=\"\",$AP$5=\"vide\"),\"\",IF(OR($AP$5=P15,P15=\"\"),IF(N15=1,1,IF(N15=2,IF($AP$5=\"Non\",0.6*S15+0.6*U15,0.75*S15+0.45*U15),IF(N15=3,IF($AP$5=\"Non\",0.4*S15+0.4*U15+0.4*AA15,0.6*S15+0.3*U15+0.3*AA15),IF($AP$5=\"Non\",((S15+U15+X15+AA15)*1.2)/N15,0.5*S15+0.2*U15+(0.25*X15)/(N15-3)+0.25*AA15)))),IF(N15=1,1,IF(N15=2,IF(P15=\"Non\",0.6*S15+0.6*U15,0.75*S15+0.45*U15),IF(N15=3,IF(P15=\"Non\",0.4*S15+0.4*U15+0.4*AA15,0.6*S15+0.3*U15+0.3*AA15),IF(P15=\"Non\",((S15+U15+X15+AA15)*1.2)/N15,0.5*S15+0.2*U15+(0.25*X15)/(N15-3)+0.25*AA15))))))","v":""},null,null,null,null,{"$f":"IF(N15=0,\"\",IF(N15=1,\"100%\",\"120%\"))","v":""},null,{"$f":"IF(AD15=\"\",\"\",IF(AG15=\"Oui\",AD15*1.5*500,AD15*100))","v":""},null,null,null,null,""]
[null,null,null,3,null,null,null,null,null,null,null,null,null,null,null,null,null,null,null,null,null,null,null,null,null,null,null,null,null,"",null,null,null,null,"",null,"",null,null,null,null,"",null,2]
[null,null,null,null,null,null,null,null,null,null,null,null,null,null,null,null,null,null,null,null,null,null,null,null,null,null,null,null,null,null,null,null,null,null,null,null,null,null,null,null,null,0]
[null,null,"Publication dans la catégorie",null,null,null,null,null,null,null,null,null,null,null,null,null,null,"A",null,null,null,null,null,null,null,null,"الإصدار ضمن الصنف",null,null,null,null,null,null,null,null,null,"50 pts/نقطة",null,null,null,null,0]
[null,null,null,null,null,null,null,null,null,null,null,null,null,null,null,null,null,null,null,null,null,null,null,null,null,null,null,null,null,null,null,null,null,null,null,null,null,null,null,null,null,0]
[null,null,null,1,null,null,null,null,null,null,null,null,null,null,null,null,null,null,null,null,null,null,null,null,null,null,null,null,null,{"$f":"IF(OR(N20=\"\",$AP$5=\"vide\"),\"\",IF(OR($AP$5=P20,P20=\"\"),IF(N20=1,1,IF(N20=2,IF($AP$5=\"Non\",0.6*S20+0.6*U20,0.75*S20+0.45*U20),IF(N20=3,IF($AP$5=\"Non\",0.4*S20+0.4*U20+0.4*AA20,0.6*S20+0.3*U20+0.3*AA20),IF($AP$5=\"Non\",((S20+U20+X20+AA20)*1.2)/N20,0.5*S20+0.2*U20+(0.25*X20)/(N20-3)+0.25*AA20)))),IF(N20=1,1,IF(N20=2,IF(P20=\"Non\",0.6*S20+0.6*U20,0.75*S20+0.45*U20),IF(N20=3,IF(P20=\"Non\",0.4*S20+0.4*U20+0.4*AA20,0.6*S20+0.3*U20+0.3*AA20),IF(P20=\"Non\",((S20+U20+X20+AA20)*1.2)/N20,0.5*S20+0.2*U20+(0.25*X20)/(N20-3)+0.25*AA20))))))","v":""},null,null,null,null,{"$f":"IF(N20=0,\"\",IF(N20=1,\"100%\",\"120%\"))","v":""},null,{"$f":"IF(AD20=\"\",\"\",IF(AG20=\"Oui\",AD20*1.5*500,AD20*50))","v":""},null,null,null,null,""]
[null,null,null,2,null,null,null,null,null,null,null,null,null,null,null,null,null,null,null,null,null,null,null,null,null,null,null,null,null,{"$f":"IF(OR(N21=\"\",$AP$5=\"vide\"),\"\",IF(OR($AP$5=P21,P21=\"\"),IF(N21=1,1,IF(N21=2,IF($AP$5=\"Non\",0.6*S21+0.6*U21,0.75*S21+0.45*U21),IF(N21=3,IF($AP$5=\"Non\",0.4*S21+0.4*U21+0.4*AA21,0.6*S21+0.3*U21+0.3*AA21),IF($AP$5=\"Non\",((S21+U21+X21+AA21)*1.2)/N21,0.5*S21+0.2*U21+(0.25*X21)/(N21-3)+0.25*AA21)))),IF(N21=1,1,IF(N21=2,IF(P21=\"Non\",0.6*S21+0.6*U21,0.75*S21+0.45*U21),IF(N21=3,IF(P21=\"Non\",0.4*S21+0.4*U21+0.4*AA21,0.6*S21+0.3*U21+0.3*AA21),IF(P21=\"Non\",((S21+U21+X21+AA21)*1.2)/N21,0.5*S21+0.2*U21+(0.25*X21)/(N21-3)+0.25*AA21))))))","v":""},null,null,null,null,{"$f":"IF(N21=0,\"\",IF(N21=1,\"100%\",\"120%\"))","v":""},null,{"$f":"IF(AD21=\"\",\"\",IF(AG21=\"Oui\",AD21*1.5*500,AD21*50))","v":""},null,null,null,null,""]
[null,null,null,3,null,null,null,null,null,null,null,null,null,null,null,null,null,null,null,null,null,null,null,null,null,null,null,null,null,"",null,null,null,null,"",null,"",null,null,null,null,"",null,null,3]
[null,null,null,null,null,null,null,null,null,null,null,null,null,null,null,null,null,null,null,null,null,null,null,null,null,null,null,null,null,null,null,null,null,null,null,null,null,null,null,null,null,0]
[null,null,"Publication dans la catégorie",null,null,null,null,null,null,null,null,null,null,null,null,null,null,"B",null,null,null,null,null,null,null,null,"الإصدار ضمن الصنف",null,null,null,null,null,null,null,null,null,"25 pts/نقطة",null,null,null,null,0]
[null,null,null,null,null,null,null,null,null,null,null,null,null,null,null,null,null,null,null,null,null,null,null,null,null,null,null,null,null,null,null,null,null,null,null,null,null,null,null,null,null,0]
[null,null,null,1,null,null,null,null,null,null,null,null,null,null,null,null,null,null,null,null,null,null,null,null,null,null,null,null,null,{"$f":"IF(OR(N26=\"\",$AP$5=\"vide\"),\"\",IF(OR($AP$5=P26,P26=\"\"),IF(N26=1,1,IF(N26=2,IF($AP$5=\"Non\",0.6*S26+0.6*U26,0.75*S26+0.45*U26),IF(N26=3,IF($AP$5=\"Non\",0.4*S26+0.4*U26+0.4*AA26,0.6*S26+0.3*U26+0.3*AA26),IF($AP$5=\"Non\",((S26+U26+X26+AA26)*1.2)/N26,0.5*S26+0.2*U26+(0.25*X26)/(N26-3)+0.25*AA26)))),IF(N26=1,1,IF(N26=2,IF(P26=\"Non\",0.6*S26+0.6*U26,0.75*S26+0.45*U26),IF(N26=3,IF(P26=\"Non\",0.4*S26+0.4*U26+0.4*AA26,0.6*S26+0.3*U26+0.3*AA26),IF(P26=\"Non\",((S26+U26+X26+AA26)*1.2)/N26,0.5*S26+0.2*U26+(0.25*X26)/(N26-3)+0.25*AA26))))))","v":""},null,null,null,null,{"$f":"IF(N26=0,\"\",IF(N26=1,\"100%\",\"120%\"))","v":""},null,{"$f":"IF(AD26=\"\",\"\",IF(AG26=\"Oui\",AD26*1.5*500,AD26*25))","v":""},null,null,null,null,""]
[null,null,null,2,null,null,null,null,null,null,null,null,null,null,null,null,null,null,null,null,null,null,null,null,null,null,null,null,null,{"$f":"IF(OR(N27=\"\",$AP$5=\"vide\"),\"\",IF(OR($AP$5=P27,P27=\"\"),IF(N27=1,1,IF(N27=2,IF($AP$5=\"Non\",0.6*S27+0.6*U27,0.75*S27+0.45*U27),IF(N27=3,IF($AP$5=\"Non\",0.4*S27+0.4*U27+0.4*AA27,0.6*S27+0.3*U27+0.3*AA27),IF($AP$5=\"Non\",((S27+U27+X27+AA27)*1.2)/N27,0.5*S27+0.2*U27+(0.25*X27)/(N27-3)+0.25*AA27)))),IF(N27=1,1,IF(N27=2,IF(P27=\"Non\",0.6*S27+0.6*U27,0.75*S27+0.45*U27),IF(N27=3,IF(P27=\"Non\",0.4*S27+0.4*U27+0.4*AA27,0.6*S27+0.3*U27+0.3*AA27),IF(P27=\"Non\",((S27+U27+X27+AA27)*1.2)/N27,0.5*S27+0.2*U27+(0.25*X27)/(N27-3)+0.25*AA27))))))","v":""},null,null,null,null,{"$f":"IF(N27=0,\"\",IF(N27=1,\"100%\",\"120%\"))","v":""},null,{"$f":"IF(AD27=\"\",\"\",IF(AG27=\"Oui\",AD27*1.5*500,AD27*25))","v":""},null,null,null,null,""]
[null,null,null,3,null,null,null,null,null,null,null,null,null,null,null,null,null,null,null,null,null,null,null,null,null,null,null,null,null,"",null,null,null,null,"",null,"",null,null,null,null,"",null,null,null,4]
[null,null,null,null,null,null,null,null,null,null,null,null,null,null,null,null,null,null,null,null,null,null,null,null,null,null,null,null,null,null,null,null,null,null,null,null,null,null,null,null,null,0]
[null,null,"Publication dans la catégorie",null,null,null,null,null,null,null,null,null,null,null,null,null,null,"C",null,null,null,null,null,null,null,null,"الإصدار ضمن الصنف",null,null,null,null,null,null,null,null,null,"12 pts/نقطة",null,null,null,null,0]
[null,null,null,null,null,null,null,null,null,null,null,null,null,null,null,null,null,null,null,null,null,null,null,null,null,null,null,null,null,null,null,null,null,null,null,null,null,null,null,null,null,0]
[null,null,null,1,null,null,null,null,null,null,null,null,null,null,null,null,null,null,null,null,null,null,null,null,null,null,null,null,null,{"$f":"IF(OR(N32=\"\",$AP$5=\"vide\"),\"\",IF(OR($AP$5=P32,P32=\"\"),IF(N32=1,1,IF(N32=2,IF($AP$5=\"Non\",0.6*S32+0.6*U32,0.75*S32+0.45*U32),IF(N32=3,IF($AP$5=\"Non\",0.4*S32+0.4*U32+0.4*AA32,0.6*S32+0.3*U32+0.3*AA32),IF($AP$5=\"Non\",((S32+U32+X32+AA32)*1.2)/N32,0.5*S32+0.2*U32+(0.25*X32)/(N32-3)+0.25*AA32)))),IF(N32=1,1,IF(N32=2,IF(P32=\"Non\",0.6*S32+0.6*U32,0.75*S32+0.45*U32),IF(N32=3,IF(P32=\"Non\",0.4*S32+0.4*U32+0.4*AA32,0.6*S32+0.3*U32+0.3*AA32),IF(P32=\"Non\",((S32+U32+X32+AA32)*1.2)/N32,0.5*S32+0.2*U32+(0.25*X32)/(N32-3)+0.25*AA32))))))","v":""},null,null,null,null,{"$f":"IF(N32=0,\"\",IF(N32=1,\"100%\",\"120%\"))","v":""},null,{"$f":"IF(AD32=\"\",\"\",IF(AG32=\"Oui\",AD32*1.5*500,AD32*12))","v":""},null,null,null,null,""]
[null,null,null,2,null,null,null,null,null,null,null,null,null,null,null,null,null,null,null,null,null,null,null,null,null,null,null,null,null,{"$f":"IF(OR(N33=\"\",$AP$5=\"vide\"),\"\",IF(OR($AP$5=P33,P33=\"\"),IF(N33=1,1,IF(N33=2,IF($AP$5=\"Non\",0.6*S33+0.6*U33,0.75*S33+0.45*U33),IF(N33=3,IF($AP$5=\"Non\",0.4*S33+0.4*U33+0.4*AA33,0.6*S33+0.3*U33+0.3*AA33),IF($AP$5=\"Non\",((S33+U33+X33+AA33)*1.2)/N33,0.5*S33+0.2*U33+(0.25*X33)/(N33-3)+0.25*AA33)))),IF(N33=1,1,IF(N33=2,IF(P33=\"Non\",0.6*S33+0.6*U33,0.75*S33+0.45*U33),IF(N33=3,IF(P33=\"Non\",0.4*S33+0.4*U33+0.4*AA33,0.6*S33+0.3*U33+0.3*AA33),IF(P33=\"Non\",((S33+U33+X33+AA33)*1.2)/N33,0.5*S33+0.2*U33+(0.25*X33)/(N33-3)+0.25*AA33))))))","v":""},null,null,null,null,{"$f":"IF(N33=0,\"\",IF(N33=1,\"100%\",\"120%\"))","v":""},null,{"$f":"IF(AD33=\"\",\"\",IF(AG33=\"Oui\",AD33*1.5*500,AD33*12))","v":""},null,null,null,null,""]
[null,null,null,3,null,null,null,null,null,null,null,null,null,null,null,null,null,null,null,null,null,null,null,null,null,null,null,null,null,"",null,null,null,null,"",null,"",null,null,null,null,"",null,null,null,null,5]
[null,null,null,null,null,null,null,null,null,null,null,null,null,null,null,null,null,null,null,null,null,null,null,null,null,null,null,null,null,null,null,null,null,null,null,null,null,null,null,null,null,0]
[null,null,"Publication dans la catégorie",null,null,null,null,null,null,null,null,null,null,null,null,null,null,"D",null,null,null,null,null,null,null,null,"الإصدار ضمن الصنف",null,null,null,null,null,null,null,null,null,"6 pts/نقطة",null,null,null,null,0]
[null,null,null,null,null,null,null,null,null,null,null,null,null,null,null,null,null,null,null,null,null,null,null,null,null,null,null,null,null,null,null,null,null,null,null,null,null,null,null,null,null,0]
[null,null,null,1,null,null,null,null,null,null,null,null,null,null,null,null,null,null,null,null,null,null,null,null,null,null,null,null,null,{"$f":"IF(OR(N38=\"\",$AP$5=\"vide\"),\"\",IF(OR($AP$5=P38,P38=\"\"),IF(N38=1,1,IF(N38=2,IF($AP$5=\"Non\",0.6*S38+0.6*U38,0.75*S38+0.45*U38),IF(N38=3,IF($AP$5=\"Non\",0.4*S38+0.4*U38+0.4*AA38,0.6*S38+0.3*U38+0.3*AA38),IF($AP$5=\"Non\",((S38+U38+X38+AA38)*1.2)/N38,0.5*S38+0.2*U38+(0.25*X38)/(N38-3)+0.25*AA38)))),IF(N38=1,1,IF(N38=2,IF(P38=\"Non\",0.6*S38+0.6*U38,0.75*S38+0.45*U38),IF(N38=3,IF(P38=\"Non\",0.4*S38+0.4*U38+0.4*AA38,0.6*S38+0.3*U38+0.3*AA38),IF(P38=\"Non\",((S38+U38+X38+AA38)*1.2)/N38,0.5*S38+0.2*U38+(0.25*X38)/(N38-3)+0.25*AA38))))))","v":""},null,null,null,null,{"$f":"IF(N38=0,\"\",IF(N38=1,\"100%\",\"120%\"))","v":""},null,{"$f":"IF(AD38=\"\",\"\",IF(AG38=\"Oui\",AD38*1.5*500,AD38*6))","v":""},null,null,null,null,""]
[null,null,null,2,null,null,null,null,null,null,null,null,null,null,null,null,null,null,null,null,null,null,null,null,null,null,null,null,null,{"$f":"IF(OR(N39=\"\",$AP$5=\"vide\"),\"\",IF(OR($AP$5=P39,P39=\"\"),IF(N39=1,1,IF(N39=2,IF($AP$5=\"Non\",0.6*S39+0.6*U39,0.75*S39+0.45*U39),IF(N39=3,IF($AP$5=\"Non\",0.4*S39+0.4*U39+0.4*AA39,0.6*S39+0.3*U39+0.3*AA39),IF($AP$5=\"Non\",((S39+U39+X39+AA39)*1.2)/N39,0.5*S39+0.2*U39+(0.25*X39)/(N39-3)+0.25*AA39)))),IF(N39=1,1,IF(N39=2,IF(P39=\"Non\",0.6*S39+0.6*U39,0.75*S39+0.45*U39),IF(N39=3,IF(P39=\"Non\",0.4*S39+0.4*U39+0.4*AA39,0.6*S39+0.3*U39+0.3*AA39),IF(P39=\"Non\",((S39+U39+X39+AA39)*1.2)/N39,0.5*S39+0.2*U39+(0.25*X39)/(N39-3)+0.25*AA39))))))","v":""},null,null,null,null,{"$f":"IF(N39=0,\"\",IF(N39=1,\"100%\",\"120%\"))","v":""},null,{"$f":"IF(AD39=\"\",\"\",IF(AG39=\"Oui\",AD39*1.5*500,AD39*6))","v":""},null,null,null,null,""]
[null,null,null,3,null,null,null,null,null,null,null,null,null,null,null,null,null,null,null,null,null,null,null,null,null,null,null,null,null,"",null,null,null,null,"",null,"",null,null,null,null,"",null,null,null,null,null,6]
[null,null,null,null,null,null,null,null,null,null,null,null,null,null,null,null,null,null,null,null,null,null,null,null,null,null,null,null,null,null,null,null,null,null,null,null,null,null,null,null,null,0]
[null,null,"Publication dans la catégorie (à l’international)",null,null,null,null,null,null,null,null,null,null,null,null,null,null,"E",null,null,null,null,null,null,null,null,"الإصدار ضمن الصنف (على الصعيد الدولي) ",null,null,null,null,null,null,null,null,null,"40 pts/نقطة",null,null,null,null,0]
[null,null,null,null,null,null,null,null,null,null,null,null,null,null,null,null,null,null,null,null,null,null,null,null,null,null,null,null,null,null,null,null,null,null,null,null,null,null,null,null,null,0]
[null,null,null,1,null,null,null,null,null,null,null,null,null,null,null,null,null,null,null,null,null,null,null,null,null,null,null,null,null,{"$f":"IF(OR(N44=\"\",$AP$5=\"vide\"),\"\",IF(OR($AP$5=P44,P44=\"\"),IF(N44=1,1,IF(N44=2,IF($AP$5=\"Non\",0.6*S44+0.6*U44,0.75*S44+0.45*U44),IF(N44=3,IF($AP$5=\"Non\",0.4*S44+0.4*U44+0.4*AA44,0.6*S44+0.3*U44+0.3*AA44),IF($AP$5=\"Non\",((S44+U44+X44+AA44)*1.2)/N44,0.5*S44+0.2*U44+(0.25*X44)/(N44-3)+0.25*AA44)))),IF(N44=1,1,IF(N44=2,IF(P44=\"Non\",0.6*S44+0.6*U44,0.75*S44+0.45*U44),IF(N44=3,IF(P44=\"Non\",0.4*S44+0.4*U44+0.4*AA44,0.6*S44+0.3*U44+0.3*AA44),IF(P44=\"Non\",((S44+U44+X44+AA44)*1.2)/N44,0.5*S44+0.2*U44+(0.25*X44)/(N44-3)+0.25*AA44))))))","v":""},null,null,null,null,{"$f":"IF(N44=0,\"\",IF(N44=1,\"100%\",\"120%\"))","v":""},null,{"$f":"IF(AD44=\"\",\"\",IF(AG44=\"Oui\",AD44*1.5*500,AD44*40))","v":""},null,null,null,null,""]
[null,null,null,2,null,null,null,null,null,null,null,null,null,null,null,null,null,null,null,null,null,null,null,null,null,null,null,null,null,{"$f":"IF(OR(N45=\"\",$AP$5=\"vide\"),\"\",IF(OR($AP$5=P45,P45=\"\"),IF(N45=1,1,IF(N45=2,IF($AP$5=\"Non\",0.6*S45+0.6*U45,0.75*S45+0.45*U45),IF(N45=3,IF($AP$5=\"Non\",0.4*S45+0.4*U45+0.4*AA45,0.6*S45+0.3*U45+0.3*AA45),IF($AP$5=\"Non\",((S45+U45+X45+AA45)*1.2)/N45,0.5*S45+0.2*U45+(0.25*X45)/(N45-3)+0.25*AA45)))),IF(N45=1,1,IF(N45=2,IF(P45=\"Non\",0.6*S45+0.6*U45,0.75*S45+0.45*U45),IF(N45=3,IF(P45=\"Non\",0.4*S45+0.4*U45+0.4*AA45,0.6*S45+0.3*U45+0.3*AA45),IF(P45=\"Non\",((S45+U45+X45+AA45)*1.2)/N45,0.5*S45+0.2*U45+(0.25*X45)/(N45-3)+0.25*AA45))))))","v":""},null,null,null,null,{"$f":"IF(N45=0,\"\",IF(N45=1,\"100%\",\"120%\"))","v":""},null,{"$f":"IF(AD45=\"\",\"\",IF(AG45=\"Oui\",AD45*1.5*500,AD45*40))","v":""},null,null,null,null,""]
[null,null,null,3,null,null,null,null,null,null,null,null,null,null,null,null,null,null,null,null,null,null,null,null,null,null,null,null,null,"",null,null,null,null,"",null,"",null,null,null,null,"",null,null,null,null,null,null,7]
[null,null,null,null,null,null,null,null,null,null,null,null,null,null,null,null,null,null,null,null,null,null,null,null,null,null,null,null,null,null,null,null,null,null,null,null,null,null,null,null,null,0]
[null,null,"b) Ouvrages                                                        ",null,null,null,null,null,null,null,null,null,null,null,null,null,null,null,null,null,null,null,null,null,null,null,"ب) المؤلفات ",null,null,null,null,null,null,null,null,null,null,null,null,null,null,0]
[null,null,null,null,null,null,null,null,null,null,null,null,null,null,null,null,null,null,null,null,null,null,null,null,null,null,null,null,null,null,null,null,null,null,null,null,null,null,null,null,null,0]
[null,null,"Ouvrage complet de recherche (éditeurs internationaux)",null,null,null,null,null,null,null,null,null,null,null,null,null,null,"A+",null,null,null,null,null,null,null,null,"مرجع كامل للبحث (الناشرون الدوليون)",null,null,null,null,null,null,null,null,null,"300 pts/نقطة",null,null,null,null,0]
[null,null,null,null,null,null,null,null,null,null,null,null,null,null,null,null,null,null,null,null,null,null,null,null,null,null,null,null,null,null,null,null,null,null,null,null,null,null,null,null,null,0]
[null,null,null,"رقم",null,"ر دمك",null,"الناشر التجاري",null,null,null,"السنة",null,"العنوان (تحديد الصفحات)",null,null,null,null,null,null,null,null,"المؤلف (ون)",null,null,null,null,null,null,"عدد المؤلفين أعضاء",null,null,"عدد المؤلفين",null,"حصة المؤلفين",null,"القيمة",null,null,null,null,0]
[null,null,null,"N°",null,"ISSN/ISBN",null,"Editeur commercial",null,null,null,"Année",null,"Titre (en précisant les pages)",null,null,null,null,null,null,null,null,"Auteur(s)",null,null,null,null,null,null,"# auteurs M",null,null,"# auteurs",null,"Part des A",null,"Valeur",null,null,null,null,0]
[null,null,null,null,null,null,null,null,null,null,null,null,null,null,null,null,null,null,null,null,null,null,null,null,null,null,null,null,null,null,null,null,null,null,null,null,null,null,null,null,null,0]
[null,null,null,1,null,null,null,null,null,null,null,null,null,null,null,null,null,null,null,null,null,null,null,null,null,null,null,null,null,null,null,null,null,null,{"$f":"IF(OR(AG55=\"\",AD55=\"\"),\"\",AD55/AG55)","v":""},null,{"$f":"IF(AI55=\"\",\"\",AI55*300)","v":""},null,null,null,null,""]
[null,null,null,2,null,null,null,null,null,null,null,null,null,null,null,null,null,null,null,null,null,null,null,null,null,null,null,null,null,null,null,null,null,null,{"$f":"IF(OR(AG56=\"\",AD56=\"\"),\"\",AD56/AG56)","v":""},null,{"$f":"IF(AI56=\"\",\"\",AI56*300)","v":""},null,null,null,null,""]
[null,null,null,3,null,null,null,null,null,null,null,null,null,null,null,null,null,null,null,null,null,null,null,null,null,null,null,null,null,null,null,null,null,null,"",null,"",null,null,null,null,"",null,null,null,null,null,null,null,8]
[null,null,null,null,null,null,null,null,null,null,null,null,null,null,null,null,null,null,null,null,null,null,null,null,null,null,null,null,null,null,null,null,null,null,null,null,null,null,null,null,null,0]
[null,null,"Chapitre d’ouvrage  complet de recherche (éditeurs internationaux)",null,null,null,null,null,null,null,null,null,null,null,null,null,null,"A",null,null,null,null,null,null,null,null,"فصل من مرجع كامل للبحث (الناشرون الدوليون)",null,null,null,null,null,null,null,null,null,"120 pts/نقطة",null,null,null,null,0]
[null,null,null,null,null,null,null,null,null,null,null,null,null,null,null,null,null,null,null,null,null,null,null,null,null,null,null,null,null,null,null,null,null,null,null,null,null,null,null,null,null,0]
[null,null,null,1,null,null,null,null,null,null,null,null,null,null,null,null,null,null,null,null,null,null,null,null,null,null,null,null,null,null,null,null,null,null,{"$f":"IF(OR(AG61=\"\",AD61=\"\"),\"\",AD61/AG61)","v":""},null,{"$f":"IF(AI61=\"\",\"\",AI61*120)","v":""},null,null,null,null,""]
[null,null,null,2,null,null,null,null,null,null,null,null,null,null,null,null,null,null,null,null,null,null,null,null,null,null,null,null,null,null,null,null,null,null,{"$f":"IF(OR(AG62=\"\",AD62=\"\"),\"\",AD62/AG62)","v":""},null,{"$f":"IF(AI62=\"\",\"\",AI62*120)","v":""},null,null,null,null,""]
[null,null,null,3,null,null,null,null,null,null,null,null,null,null,null,null,null,null,null,null,null,null,null,null,null,null,null,null,null,null,null,null,null,null,"",null,"",null,null,null,null,"",null,null,null,null,null,null,null,null,9]
[null,null,null,null,null,null,null,null,null,null,null,null,null,null,null,null,null,null,null,null,null,null,null,null,null,null,null,null,null,null,null,null,null,null,null,null,null,null,null,null,null,0]
[null,null,"Traduction d’ouvrage de spécialité",null,null,null,null,null,null,null,null,null,null,null,null,null,null,"A’",null,null,null,null,null,null,null,null,"كتاب مترجم في التخصص",null,null,null,null,null,null,null,null,null,"100 pts/نقطة",null,null,null,null,0]
[null,null,null,null,null,null,null,null,null,null,null,null,null,null,null,null,null,null,null,null,null,null,null,null,null,null,null,null,null,null,null,null,null,null,null,null,null,null,null,null,null,0]
[null,null,null,1,null,null,null,null,null,null,null,null,null,null,null,null,null,null,null,null,null,null,null,null,null,null,null,null,null,null,null,null,null,null,{"$f":"IF(OR(AG67=\"\",AD67=\"\"),\"\",AD67/AG67)","v":""},null,{"$f":"IF(AI67=\"\",\"\",AI67*100)","v":""},null,null,null,null,""]
[null,null,null,2,null,null,null,null,null,null,null,null,null,null,null,null,null,null,null,null,null,null,null,null,null,null,null,null,null,null,null,null,null,null,{"$f":"IF(OR(AG68=\"\",AD68=\"\"),\"\",AD68/AG68)","v":""},null,{"$f":"IF(AI68=\"\",\"\",AI68*100)","v":""},null,null,null,null,""]
[null,null,null,3,null,null,null,null,null,null,null,null,null,null,null,null,null,null,null,null,null,null,null,null,null,null,null,null,null,null,null,null,null,null,"",null,"",null,null,null,null,"",null,null,null,null,null,null,null,null,null,10]
[null,null,null,null,null,null,null,null,null,null,null,null,null,null,null,null,null,null,null,null,null,null,null,null,null,null,null,null,null,null,null,null,null,null,null,null,null,null,null,null,null,0]
[null,null,"Analyse et commentaire d’un manuscrit",null,null,null,null,null,null,null,null,null,null,null,null,null,null,"A’’",null,null,null,null,"تحقيق أو دراسة مخطوط",null,null,null,null,null,null,null,null,null,null,null,null,null,"100 pts/نقطة",null,null,null,null,0]
[null,null,null,null,null,null,null,null,null,null,null,null,null,null,null,null,null,null,null,null,null,null,null,null,null,null,null,null,null,null,null,null,null,null,null,null,null,null,null,null,null,0]
[null,null,null,1,null,null,null,null,null,null,null,null,null,null,null,null,null,null,null,null,null,null,null,null,null,null,null,null,null,null,null,null,null,null,{"$f":"IF(OR(AG73=\"\",AD73=\"\"),\"\",AD73/AG73)","v":""},null,{"$f":"IF(AI73=\"\",\"\",AI73*100)","v":""},null,null,null,null,{"$f":"IF(OR(AK73=\"Valeur\",AK73=\"القيمة\"),0,IF(ISERROR(SEARCH(\"/\",AK73)),AK73,0))","v":""}]
[null,null,null,2,null,null,null,null,null,null,null,null,null,null,null,null,null,null,null,null,null,null,null,null,null,null,null,null,null,null,null,null,null,null,{"$f":"IF(OR(AG74=\"\",AD74=\"\"),\"\",AD74/AG74)","v":""},null,{"$f":"IF(AI74=\"\",\"\",AI74*100)","v":""},null,null,null,null,""]
[null,null,null,3,null,null,null,null,null,null,null,null,null,null,null,null,null,null,null,null,null,null,null,null,null,null,null,null,null,null,null,null,null,null,"",null,"",null,null,null,null,"",null,null,null,null,null,null,null,null,null,null,11]
[null,null,null,null,null,null,null,null,null,null,null,null,null,null,null,null,null,null,null,null,null,null,null,null,null,null,null,null,null,null,null,null,null,null,null,null,null,null,null,null,null,0]
[null,null,"Ouvrage complet de recherche (éditeurs nationaux)",null,null,null,null,null,null,null,null,null,null,null,null,null,null,"B+",null,null,null,null,"مرجع كامل للبحث (الناشرون الوطنيون)",null,null,null,null,null,null,null,null,null,null,null,null,null,"80 pts/نقطة",null,null,null,null,0]
[null,null,null,null,null,null,null,null,null,null,null,null,null,null,null,null,null,null,null,null,null,null,null,null,null,null,null,null,null,null,null,null,null,null,null,null,null,null,null,null,null,0]
[null,null,null,1,null,null,null,null,null,null,null,null,null,null,null,null,null,null,null,null,null,null,null,null,null,null,null,null,null,null,null,null,null,null,{"$f":"IF(OR(AG79=\"\",AD79=\"\"),\"\",AD79/AG79)","v":""},null,{"$f":"IF(AI79=\"\",\"\",AI79*80)","v":""},null,null,null,null,"",null,null,null,null,null,null,null,null,null,null,null,null,null,null,null,null,null,null,null,null,null,null,null,null,null,26]
[null,null,null,2,null,null,null,null,null,null,null,null,null,null,null,null,null,null,null,null,null,null,null,null,null,null,null,null,null,null,null,null,null,null,{"$f":"IF(OR(AG80=\"\",AD80=\"\"),\"\",AD80/AG80)","v":""},null,{"$f":"IF(AI80=\"\",\"\",AI80*80)","v":""},null,null,null,null,""]
[null,null,null,3,null,null,null,null,null,null,null,null,null,null,null,null,null,null,null,null,null,null,null,null,null,null,null,null,null,null,null,null,null,null,"",null,"",null,null,null,null,"",null,null,null,null,null,null,null,null,null,null,null,12]
[null,null,null,null,null,null,null,null,null,null,null,null,null,null,null,null,null,null,null,null,null,null,null,null,null,null,null,null,null,null,null,null,null,null,null,null,null,null,null,null,null,0]
[null,null,"Chapitre d’ouvrage  complet de recherche (éditeurs nationaux)",null,null,null,null,null,null,null,null,null,null,null,null,null,null,"B",null,null,null,null,"فصل من مرجع بحث أو كتاب مترجم أو تحقيق (الناشرين الوطنيون)",null,null,null,null,null,null,null,null,null,null,null,null,null,"32 pts/نقطة",null,null,null,null,0]
[null,null,null,null,null,null,null,null,null,null,null,null,null,null,null,null,null,null,null,null,null,null,null,null,null,null,null,null,null,null,null,null,null,null,null,null,null,null,null,null,null,0]
[null,null,null,1,null,null,null,null,null,null,null,null,null,null,null,null,null,null,null,null,null,null,null,null,null,null,null,null,null,null,null,null,null,null,{"$f":"IF(OR(AG85=\"\",AD85=\"\"),\"\",AD85/AG85)","v":""},null,{"$f":"IF(AI85=\"\",\"\",AI85*32)","v":""},null,null,null,null,""]
[null,null,null,2,null,null,null,null,null,null,null,null,null,null,null,null,null,null,null,null,null,null,null,null,null,null,null,null,null,null,null,null,null,null,{"$f":"IF(OR(AG86=\"\",AD86=\"\"),\"\",AD86/AG86)","v":""},null,{"$f":"IF(AI86=\"\",\"\",AI86*32)","v":""},null,null,null,null,""]
[null,null,null,3,null,null,null,null,null,null,null,null,null,null,null,null,null,null,null,null,null,null,null,null,null,null,null,null,null,null,null,null,null,null,"",null,"",null,null,null,null,"",null,null,null,null,null,null,null,null,null,null,null,null,13]
[null,null,null,null,null,null,null,null,null,null,null,null,null,null,null,null,null,null,null,null,null,null,null,null,null,null,null,null,null,null,null,null,null,null,null,null,null,null,null,null,null,0]
[null,null,"Ouvrage pédagogique édité",null,null,null,null,null,null,null,null,null,null,null,null,null,null,"C+",null,null,null,null,"مرجع بيداغوجي مطبوع",null,null,null,null,null,null,null,null,null,null,null,null,null,"50 pts/نقطة",null,null,null,null,0]
[null,null,null,null,null,null,null,null,null,null,null,null,null,null,null,null,null,null,null,null,null,null,null,null,null,null,null,null,null,null,null,null,null,null,null,null,null,null,null,null,null,0]
[null,null,null,1,null,null,null,null,null,null,null,null,null,null,null,null,null,null,null,null,null,null,null,null,null,null,null,null,null,null,null,null,null,null,{"$f":"IF(OR(AG91=\"\",AD91=\"\"),\"\",AD91/AG91)","v":""},null,{"$f":"IF(AI91=\"\",\"\",AI91*50)","v":""},null,null,null,null,""]
[null,null,null,2,null,null,null,null,null,null,null,null,null,null,null,null,null,null,null,null,null,null,null,null,null,null,null,null,null,null,null,null,null,null,{"$f":"IF(OR(AG92=\"\",AD92=\"\"),\"\",AD92/AG92)","v":""},null,{"$f":"IF(AI92=\"\",\"\",AI92*50)","v":""},null,null,null,null,""]
[null,null,null,3,null,null,null,null,null,null,null,null,null,null,null,null,null,null,null,null,null,null,null,null,null,null,null,null,null,null,null,null,null,null,"",null,"",null,null,null,null,"",null,null,null,null,null,null,null,null,null,null,null,null,null,14]
[null,null,null,null,null,null,null,null,null,null,null,null,null,null,null,null,null,null,null,null,null,null,null,null,null,null,null,null,null,null,null,null,null,null,null,null,null,null,null,null,null,0]
[null,null,"Chapitre d’ouvrage  pédagogique édité",null,null,null,null,null,null,null,null,null,null,null,null,null,null,"C",null,null,null,null,"فصل من مرجع بيداغوجي مطبوع",null,null,null,null,null,null,null,null,null,null,null,null,null,"20 pts/نقطة",null,null,null,null,0]
[null,null,null,null,null,null,null,null,null,null,null,null,null,null,null,null,null,null,null,null,null,null,null,null,null,null,null,null,null,null,null,null,null,null,null,null,null,null,null,null,null,0]
[null,null,null,1,null,null,null,null,null,null,null,null,null,null,null,null,null,null,null,null,null,null,null,null,null,null,null,null,null,null,null,null,null,null,{"$f":"IF(OR(AG97=\"\",AD97=\"\"),\"\",AD97/AG97)","v":""},null,{"$f":"IF(AI97=\"\",\"\",AI97*20)","v":""},null,null,null,null,""]
[null,null,null,2,null,null,null,null,null,null,null,null,null,null,null,null,null,null,null,null,null,null,null,null,null,null,null,null,null,null,null,null,null,null,{"$f":"IF(OR(AG98=\"\",AD98=\"\"),\"\",AD98/AG98)","v":""},null,{"$f":"IF(AI98=\"\",\"\",AI98*20)","v":""},null,null,null,null,""]
[null,null,null,3,null,null,null,null,null,null,null,null,null,null,null,null,null,null,null,null,null,null,null,null,null,null,null,null,null,null,null,null,null,null,"",null,"",null,null,null,null,"",null,null,null,null,null,null,null,null,null,null,null,null,null,null,15]
[null,null,null,null,null,null,null,null,null,null,null,null,null,null,null,null,null,null,null,null,null,null,null,null,null,null,null,null,null,null,null,null,null,null,null,null,null,null,null,null,null,0]
[null,null,"Polycopié édité d’un cours",null,null,null,null,null,null,null,null,null,null,null,null,null,null,"D",null,null,null,null,null,null,null,null,"مطبوعة",null,null,null,null,null,null,null,null,null,"15 pts/نقطة",null,null,null,null,0]
[null,null,null,null,null,null,null,null,null,null,null,null,null,null,null,null,null,null,null,null,null,null,null,null,null,null,null,null,null,null,null,null,null,null,null,null,null,null,null,null,null,0]
[null,null,null,1,null,null,null,null,null,null,null,null,null,null,null,null,null,null,null,null,null,null,null,null,null,null,null,null,null,null,null,null,null,null,{"$f":"IF(OR(AG103=\"\",AD103=\"\"),\"\",AD103/AG103)","v":""},null,{"$f":"IF(AI103=\"\",\"\",AI103*15)","v":""},null,null,null,null,""]
[null,null,null,2,null,null,null,null,null,null,null,null,null,null,null,null,null,null,null,null,null,null,null,null,null,null,null,null,null,null,null,null,null,null,{"$f":"IF(OR(AG104=\"\",AD104=\"\"),\"\",AD104/AG104)","v":""},null,{"$f":"IF(AI104=\"\",\"\",AI104*15)","v":""},null,null,null,null,""]
[null,null,null,3,null,null,null,null,null,null,null,null,null,null,null,null,null,null,null,null,null,null,null,null,null,null,null,null,null,null,null,null,null,null,"",null,"",null,null,null,null,"",null,null,null,null,null,null,null,null,null,null,null,null,null,null,null,16]
[null,null,null,null,null,null,null,null,null,null,null,null,null,null,null,null,null,null,null,null,null,null,null,null,null,null,null,null,null,null,null,null,null,null,null,null,null,null,null,null,null,0]
[null,null,"c) Editeur chef ou membre d’un comité éditorial en cours",null,null,null,null,null,null,null,null,null,null,null,null,null,null,null,null,null,null,null,null,null,null,null," ج) ناشر أو عضو لجنة نشر ",null,null,null,null,null,null,null,null,null,null,null,null,null,null,0]
[null,null,null,null,null,null,null,null,null,null,null,null,null,null,null,null,null,null,null,null,null,null,null,null,null,null,null,null,null,null,null,null,null,null,null,null,null,null,null,null,null,0]
[null,null,"Membre du comité éditorial d’un livre",null,null,null,null,null,null,null,null,null,null,null,null,null,null,"L",null,null,null,null,null,null,null,null,"عضو لجنة نشر كتاب ما",null,null,null,null,null,null,null,null,null,"30 pts/نقطة",null,null,null,null,0]
[null,null,null,null,null,null,null,null,null,null,null,null,null,null,null,null,null,null,null,null,null,null,null,null,null,null,null,null,null,null,null,null,null,null,null,null,null,null,null,null,null,0]
[null,null,null,"رقم",null,"ر دمك",null,"الناشر التجاري",null,null,null,"السنة",null,"عنوان المجلة أو الكتاب (حدّد السنة)",null,null,null,null,null,null,null,null,"الناشر (ين) العلمي (ين)",null,null,null,null,null,null,null,null,null,"رئيس تحرير/عضو",null,"حصة المؤلفين",null,"القيمة",null,null,null,null,0]
[null,null,null,"N°",null,"ISSN/ISBN",null,"Editeur commercial",null,null,null,"Année",null,"Titre de la revue ou du livre (Préciser l’année)",null,null,null,null,null,null,null,null,"Editeur(s) Scientifique(s)",null,null,null,null,null,null,null,null,null,"E/M ",null,"Part des A",null,"Valeur",null,null,null,null,0]
[null,null,null,null,null,null,null,null,null,null,null,null,null,null,null,null,null,null,null,null,null,null,null,null,null,null,null,null,null,null,null,null,null,null,null,null,null,null,null,null,null,0]
[null,null,null,1,null,null,null,null,null,null,null,null,null,null,null,null,null,null,null,null,null,null,null,null,null,null,null,null,null,null,null,null,null,null,{"$f":"IF(AG114<>\"\",IF(AG114=\"Membre\",\"50%\",\"100%\"),\"\")","v":""},null,{"$f":"IF(AI114=\"\",\"\",AI114*30)","v":""},null,null,null,null,""]
[null,null,null,2,null,null,null,null,null,null,null,null,null,null,null,null,null,null,null,null,null,null,null,null,null,null,null,null,null,null,null,null,null,null,{"$f":"IF(AG115=\"\",\"\",IF(AG115=\"Membre\",100%,50%))","v":""},null,{"$f":"IF(AI115=\"\",\"\",AI115*30)","v":""},null,null,null,null,""]
[null,null,null,3,null,null,null,null,null,null,null,null,null,null,null,null,null,null,null,null,null,null,null,null,null,null,null,null,null,null,null,null,null,null,{"$f":"IF(AG116=\"\",\"\",IF(AG116=\"Membre\",100%,50%))","v":""},null,"",null,null,null,null,"",null,null,null,null,null,null,null,null,null,null,null,null,null,null,null,null,17]
[null,null,null,null,null,null,null,null,null,null,null,null,null,null,null,null,null,null,null,null,null,null,null,null,null,null,null,null,null,null,null,null,null,null,null,null,null,null,null,null,null,0]
[null,null,"Catégorie exceptionnelle",null,null,null,null,null,null,null,null,null,null,null,null,null,null,"Exp",null,null,null,null,null,null,null,null,"الصنف الاستثنائي",null,null,null,null,null,null,null,null,null,"100 pts/نقطة",null,null,null,null,0]
[null,null,null,null,null,null,null,null,null,null,null,null,null,null,null,null,null,null,null,null,null,null,null,null,null,null,null,null,null,null,null,null,null,null,null,null,null,null,null,null,null,0]
[null,null,null,1,null,null,null,null,null,null,null,null,null,null,null,null,null,null,null,null,null,null,null,null,null,null,null,null,null,null,null,null,null,null,{"$f":"IF(AG120<>\"\",IF(AG120=\"Membre\",\"50%\",\"100%\"),\"\")","v":""},null,{"$f":"IF(AI120=\"\",\"\",AI120*100)","v":""},null,null,null,null,""]
[null,null,null,2,null,null,null,null,null,null,null,null,null,null,null,null,null,null,null,null,null,null,null,null,null,null,null,null,null,null,null,null,null,null,{"$f":"IF(AG121=\"\",\"\",IF(AG121=\"Membre\",100%,50%))","v":""},null,{"$f":"IF(AI121=\"\",\"\",AI121*100)","v":""},null,null,null,null,"",null,null,null,null,null,null,null,null,null,null,null,null,null,null,null,null,null,16]
[null,null,null,3,null,null,null,null,null,null,null,null,null,null,null,null,null,null,null,null,null,null,null,null,null,null,null,null,null,null,null,null,null,null,{"$f":"IF(AG122=\"\",\"\",IF(AG122=\"Membre\",100%,50%))","v":""},null,"",null,null,null,null,"",null,null,null,null,null,null,null,null,null,null,null,null,null,null,null,null,null,16]
[null,null,null,1,null,null,null,null,null,null,null,null,null,null,null,null,null,null,null,null,null,null,null,null,null,null,null,null,null,null,null,null,null,null,null,null,null,null,null,null,null,0]
[null,null,"« Spécial issue » WOS",null,null,null,null,null,null,null,null,null,null,null,null,null,null,"A+",null,null,null,null,null,null,null,null,"WOS \"عدد خاص\"",null,null,null,null,null,null,null,null,null,"50 pts/نقطة",null,null,null,null,0]
[null,null,null,null,null,null,null,null,null,null,null,null,null,null,null,null,null,null,null,null,null,null,null,null,null,null,null,null,null,null,null,null,null,null,null,null,null,null,null,null,null,0]
[null,null,null,1,null,null,null,null,null,null,null,null,null,null,null,null,null,null,null,null,null,null,null,null,null,null,null,null,null,null,null,null,null,null,{"$f":"IF(AG126<>\"\",IF(AG126=\"Membre\",\"50%\",\"100%\"),\"\")","v":""},null,{"$f":"IF(AI126=\"\",\"\",AI126*50)","v":""},null,null,null,null,""]
[null,null,null,2,null,null,null,null,null,null,null,null,null,null,null,null,null,null,null,null,null,null,null,null,null,null,null,null,null,null,null,null,null,null,{"$f":"IF(AG127=\"\",\"\",IF(AG127=\"Membre\",100%,50%))","v":""},null,{"$f":"IF(AI127=\"\",\"\",AI127*50)","v":""},null,null,null,null,""]
[null,null,null,3,null,null,null,null,null,null,null,null,null,null,null,null,null,null,null,null,null,null,null,null,null,null,null,null,null,null,null,null,null,null,{"$f":"IF(AG128=\"\",\"\",IF(AG128=\"Membre\",100%,50%))","v":""},null,"",null,null,null,null,"",null,null,null,null,null,null,null,null,null,null,null,null,null,null,null,null,null,null,19]
[null,null,null,null,null,null,null,null,null,null,null,null,null,null,null,null,null,null,null,null,null,null,null,null,null,null,null,null,null,null,null,null,null,null,null,null,null,null,null,null,null,0]
[null,null,"Revue WOS",null,null,null,null,null,null,null,null,null,null,null,null,null,null,"A",null,null,null,null,null,null,null,null,"مجلة واب أوف ساينس",null,null,null,null,null,null,null,null,null,"30 pts/نقطة",null,null,null,null,0]
[null,null,null,null,null,null,null,null,null,null,null,null,null,null,null,null,null,null,null,null,null,null,null,null,null,null,null,null,null,null,null,null,null,null,null,null,null,null,null,null,null,0]
[null,null,null,1,null,null,null,null,null,null,null,null,null,null,null,null,null,null,null,null,null,null,null,null,null,null,null,null,null,null,null,null,null,null,{"$f":"IF(AG132<>\"\",IF(AG132=\"Membre\",\"50%\",\"100%\"),\"\")","v":""},null,{"$f":"IF(AI132=\"\",\"\",AI132*30)","v":""},null,null,null,null,""]
[null,null,null,2,null,null,null,null,null,null,null,null,null,null,null,null,null,null,null,null,null,null,null,null,null,null,null,null,null,null,null,null,null,null,{"$f":"IF(AG133=\"\",\"\",IF(AG133=\"Membre\",100%,50%))","v":""},null,null,null,null,null,null,0]
[null,null,null,3,null,null,null,null,null,null,null,null,null,null,null,null,null,null,null,null,null,null,null,null,null,null,null,null,null,null,null,null,null,null,{"$f":"IF(AG134=\"\",\"\",IF(AG134=\"Membre\",100%,50%))","v":""},null,null,null,null,null,null,0,null,null,null,null,null,null,null,null,null,null,null,null,null,null,null,null,null,null,null,20]
[null,null,null,null,null,null,null,null,null,null,null,null,null,null,null,null,null,null,null,null,null,null,null,null,null,null,null,null,null,null,null,null,null,null,null,null,null,null,null,null,null,0]
[null,null,"«Spécial issue » d’une revue de catégorie B",null,null,null,null,null,null,null,null,null,null,null,null,null,null,"B +",null,null,null,null,null,null,null,null,"B ''عدد خاص '' لمجلة من صنف",null,null,null,null,null,null,null,null,null,"24 pts/نقطة",null,null,null,null,0]
[null,null,null,null,null,null,null,null,null,null,null,null,null,null,null,null,null,null,null,null,null,null,null,null,null,null,null,null,null,null,null,null,null,null,null,null,null,null,null,null,null,{"$f":"IF(OR(AK137=\"Valeur\",AK137=\"القيمة\"),0,IF(ISERROR(SEARCH(\"/\",AK137)),AK137,0))","v":0}]
[null,null,null,1,null,null,null,null,null,null,null,null,null,null,null,null,null,null,null,null,null,null,null,null,null,null,null,null,null,null,null,null,null,null,{"$f":"IF(AG138<>\"\",IF(AG138=\"Membre\",\"50%\",\"100%\"),\"\")","v":""},null,{"$f":"IF(AI138=\"\",\"\",AI138*24)","v":""},null,null,null,null,""]
[null,null,null,2,null,null,null,null,null,null,null,null,null,null,null,null,null,null,null,null,null,null,null,null,null,null,null,null,null,null,null,null,null,null,{"$f":"IF(AG139=\"\",\"\",IF(AG139=\"Membre\",100%,50%))","v":""},null,{"$f":"IF(AI139=\"\",\"\",AI139*24)","v":""},null,null,null,null,""]
[null,null,null,3,null,null,null,null,null,null,null,null,null,null,null,null,null,null,null,null,null,null,null,null,null,null,null,null,null,null,null,null,null,null,{"$f":"IF(AG140=\"\",\"\",IF(AG140=\"Membre\",100%,50%))","v":""},null,"",null,null,null,null,"",null,null,null,null,null,null,null,null,null,null,null,null,null,null,null,null,null,null,null,null,21]
[null,null,null,null,null,null,null,null,null,null,null,null,null,null,null,null,null,null,null,null,null,null,null,null,null,null,null,null,null,null,null,null,null,null,null,null,null,null,null,null,null,0]
[null,null,"Revue de catégorie B ou E",null,null,null,null,null,null,null,null,null,null,null,null,null,null,"B",null,null,null,null,null,null,null,null,"E أو B  مجلة من صنف",null,null,null,null,null,null,null,null,null,"20 pts/نقطة",null,null,null,null,0]
[null,null,null,null,null,null,null,null,null,null,null,null,null,null,null,null,null,null,null,null,null,null,null,null,null,null,null,null,null,null,null,null,null,null,null,null,null,null,null,null,null,0]
[null,null,null,1,null,null,null,null,null,null,null,null,null,null,null,null,null,null,null,null,null,null,null,null,null,null,null,null,null,null,null,null,null,null,{"$f":"IF(AG144<>\"\",IF(AG144=\"Membre\",\"50%\",\"100%\"),\"\")","v":""},null,{"$f":"IF(AI144=\"\",\"\",AI144*20)","v":""},null,null,null,null,""]
[null,null,null,2,null,null,null,null,null,null,null,null,null,null,null,null,null,null,null,null,null,null,null,null,null,null,null,null,null,null,null,null,null,null,{"$f":"IF(AG145=\"\",\"\",IF(AG145=\"Membre\",100%,50%))","v":""},null,{"$f":"IF(AI145=\"\",\"\",AI145*20)","v":""},null,null,null,null,""]
[null,null,null,3,null,null,null,null,null,null,null,null,null,null,null,null,null,null,null,null,null,null,null,null,null,null,null,null,null,null,null,null,null,null,{"$f":"IF(AG146=\"\",\"\",IF(AG146=\"Membre\",100%,50%))","v":""},null,"",null,null,null,null,"",null,null,null,null,null,null,null,null,null,null,null,null,null,null,null,null,null,null,null,null,null,22]
[null,null,null,null,null,null,null,null,null,null,null,null,null,null,null,null,null,null,null,null,null,null,null,null,null,null,null,null,null,null,null,null,null,null,null,null,null,null,null,null,null,0]
[null,null,"Revue de catégorie C ou D",null,null,null,null,null,null,null,null,null,null,null,null,null,null,"C",null,null,null,null,null,null,null,null,"C أو D مجلة من صنف",null,null,null,null,null,null,null,null,null,"10 pts/نقطة",null,null,null,null,0]
[null,null,null,null,null,null,null,null,null,null,null,null,null,null,null,null,null,null,null,null,null,null,null,null,null,null,null,null,null,null,null,null,null,null,null,null,null,null,null,null,null,0]
[null,null,null,1,null,null,null,null,null,null,null,null,null,null,null,null,null,null,null,null,null,null,null,null,null,null,null,null,null,null,null,null,null,null,{"$f":"IF(AG150<>\"\",IF(AG150=\"Membre\",\"50%\",\"100%\"),\"\")","v":""},null,{"$f":"IF(AI150=\"\",\"\",AI150*10)","v":""},null,null,null,null,""]
[null,null,null,2,null,null,null,null,null,null,null,null,null,null,null,null,null,null,null,null,null,null,null,null,null,null,null,null,null,null,null,null,null,null,{"$f":"IF(AG151=\"\",\"\",IF(AG151=\"Membre\",100%,50%))","v":""},null,{"$f":"IF(AI151=\"\",\"\",AI151*10)","v":""},null,null,null,null,""]
[null,null,null,3,null,null,null,null,null,null,null,null,null,null,null,null,null,null,null,null,null,null,null,null,null,null,null,null,null,null,null,null,null,null,{"$f":"IF(AG152=\"\",\"\",IF(AG152=\"Membre\",100%,50%))","v":""},null,"",null,null,null,null,"",null,null,null,null,null,null,null,null,null,null,null,null,null,null,null,null,null,null,null,null,null,null,23]
[null,null,null,null,null,null,null,null,null,null,null,null,null,null,null,null,null,null,null,null,null,null,null,null,null,null,null,null,null,null,null,null,null,null,null,null,null,null,null,null,null,0]
[null,null,"d) Brevets d’invention",null,null,null,null,null,null,null,null,null,null,null,null,null,null,null,null,null,null,null,null,null,null,null,"د) براءات الاختراع",null,null,null,null,null,null,null,null,null,null,null,null,null,null,0]
[null,null,null,null,null,null,null,null,null,null,null,null,null,null,null,null,null,null,null,null,null,null,null,null,null,null,null,null,null,null,null,null,null,null,null,null,null,null,null,null,null,0]
[null,null,"Protection internationale",null,null,null,null,null,null,null,null,null,null,null,null,null,null,"A",null,null,null,null,null,null,null,null,"الحماية الدولية",null,null,null,null,null,null,null,null,null,"200 pts/نقطة",null,null,null,null,0]
[null,null,null,null,null,null,null,null,null,null,null,null,null,null,null,null,null,null,null,null,null,null,null,null,null,null,null,null,null,null,null,null,null,null,null,null,null,null,null,null,null,0]
[null,null,null,"رقم",null,"رقم الإيداع/التسجيل",null,"العنوان",null,null,null,null,null,"السنة",null,null,null,"المؤلف (ون)",null,null,null,null,null,null,null,"مؤسسة الإيداع/التسجيل",null,null,null,null,null,null,null,null,"مودع /مسجل",null,"القيمة",null,null,null,null,0]
[null,null,null,"N°",null,"N° Dépôt/Enregistrement ",null,"Titre",null,null,null,null,null,"Année",null,null,null,"Auteur(s)",null,null,null,null,null,null,null,"Institution Dépôt/Enregistrement",null,null,null,null,null,null,null,null,"D /E",null,"Valeur",null,null,null,null,0]
[null,null,null,null,null,null,null,null,null,null,null,null,null,null,null,null,null,null,null,null,null,null,null,null,null,null,null,null,null,null,null,null,null,null,null,null,null,null,null,null,null,0]
[null,null,null,1,null,null,null,null,null,null,null,null,null,null,null,null,null,null,null,null,null,null,null,null,null,null,null,null,null,null,null,null,null,null,null,null,{"$f":"IF(AI161=\"\",\"\",IF(AI161=\"D\",200*0.2,200*1))","v":""},null,null,null,null,""]
[null,null,null,2,null,null,null,null,null,null,null,null,null,null,null,null,null,null,null,null,null,null,null,null,null,null,null,null,null,null,null,null,null,null,null,null,null,null,null,null,null,0]
[null,null,null,3,null,null,null,null,null,null,null,null,null,null,null,null,null,null,null,null,null,null,null,null,null,null,null,null,null,null,null,null,null,null,null,null,null,null,null,null,null,0,null,null,null,null,null,null,null,null,null,null,null,null,null,null,null,null,null,null,null,null,null,null,null,24]
[null,null,null,null,null,null,null,null,null,null,null,null,null,null,null,null,null,null,null,null,null,null,null,null,null,null,null,null,null,null,null,null,null,null,null,null,null,null,null,null,null,0]
[null,null,"Protection nationale",null,null,null,null,null,null,null,null,null,null,null,null,null,null,"B",null,null,null,null,null,null,null,null,"الحماية الوطنية",null,null,null,null,null,null,null,null,null,"50 pts/نقطة",null,null,null,null,0]
[null,null,null,null,null,null,null,null,null,null,null,null,null,null,null,null,null,null,null,null,null,null,null,null,null,null,null,null,null,null,null,null,null,null,null,null,null,null,null,null,null,0]
[null,null,null,1,null,null,null,null,null,null,null,null,null,null,null,null,null,null,null,null,null,null,null,null,null,null,null,null,null,null,null,null,null,null,null,null,{"$f":"IF(AI167=\"\",\"\",IF(AI167=\"D\",50*0.2,50*1))","v":""},null,null,null,null,""]
[null,null,null,2,null,null,null,null,null,null,null,null,null,null,null,null,null,null,null,null,null,null,null,null,null,null,null,null,null,null,null,null,null,null,null,null,null,null,null,null,null,0]
[null,null,null,3,null,null,null,null,null,null,null,null,null,null,null,null,null,null,null,null,null,null,null,null,null,null,null,null,null,null,null,null,null,null,null,null,null,null,null,null,null,0,null,null,null,null,null,null,null,null,null,null,null,null,null,null,null,null,null,null,null,null,null,null,null,null,25]
[]
[]
[null,null,"Tableau récapitulatif 1",null,null,null,null,null,null,null,null,null,null,null,null,null,null,null,null,null,null,null,null,null,null,null,null,null,null,null,null,null,"جدول مختصر 1"]
[]
[]
[null,null,null,"Production scientifique",null,null,null,null,null,null,null,null,null,null,null,null,null,"Valeur/القيمة",null,null,null,null,"الإنتاج العلمي "]
[null,null,null,"  a) Publications dans des revues",null,null,null,null,null,null,null,null,null,null,null,null,null,{"$f":"SUM(AP8:AP46)","v":0},null,null,null,null,"أ) النشر في المجلات"]
[null,null,null,"  b) Ouvrage",null,null,null,null,null,null,null,null,null,null,null,null,null,{"$f":"SUM(AP55:AP105)","v":0},null,null,null,null,"ب) المؤلفات"]
[null,null,null,"  c) Editeur ou membre d’un comité éditorial (en cours)",null,null,null,null,null,null,null,null,null,null,null,null,null,{"$f":"SUM(AP114:AP152)","v":0},null,null,null,null,"ج) ناشر أو عضو لجنة نشر"]
[null,null,null,"  d) Brevets d’inventions",null,null,null,null,null,null,null,null,null,null,null,null,null,{"$f":"SUM(AP161:AP169)","v":0},null,null,null,null,"د) براءات الاختراع"]
[null,null,null,"Total de la production scientifique",null,null,null,null,null,null,null,null,null,null,null,null,null,{"$f":"SUM(R176:V179)","v":0},null,null,null,null,"مجموع الإنتاج العلمي "]

{"sheet":"Eq.Ray","index":3,"n_rows":336,"n_cols":89,"rows_kept":336,"cut":false,"hidden":false,"merged":[[217,31,217,32],[210,15,210,17],[211,15,211,17],[210,24,210,27],[223,31,223,32],[217,2,217,12],[202,19,202,25],[203,19,203,25],[200,2,200,12],[200,17,200,30],[200,31,200,32],[204,19,204,25],[206,2,206,15],[208,31,208,32],[215,15,215,17],[213,15,213,17],[210,19,210,22],[211,19,211,22],[213,19,213,22],[214,19,214,22],[215,19,215,22],[208,17,208,30],[215,5,215,9],[202,9,202,13],[31,5,31,7],[32,5,32,7],[33,5,33,7],[55,5,55,7],[56,5,56,7],[37,5,37,7],[39,5,39,7],[43,5,43,7],[44,5,44,7],[45,5,45,7],[49,5,49,7],[53,2,53,12],[51,5,51,7],[39,9,39,11],[43,9,43,11],[44,9,44,11],[45,9,45,11],[41,2,41,12],[47,31,47,32],[53,17,53,30],[41,17,41,30],[38,17,38,22],[39,17,39,22],[66,24,66,25],[67,24,67,25],[68,24,68,25],[43,17,43,22],[44,17,44,22],[45,17,45,22],[57,24,57,25],[55,24,55,25],[56,24,56,25],[41,31,41,32],[51,17,51,22],[39,24,39,25],[43,24,43,25],[44,24,44,25],[45,24,45,25],[13,24,13,25],[14,24,14,25],[15,24,15,25],[19,24,19,25],[20,24,20,25],[21,24,21,25],[25,24,25,25],[26,24,26,25],[27,24,27,25],[241,31,241,32],[229,31,229,32],[235,2,235,12],[235,31,235,32],[184,19,184,25],[172,19,172,25],[173,19,173,25],[174,19,174,25],[231,15,231,17],[231,24,231,27],[232,15,232,17],[232,24,232,27],[237,24,237,27],[238,15,238,17],[238,24,238,27],[214,15,214,17],[226,15,226,17],[217,17,217,30],[213,24,213,27],[214,24,214,27],[215,24,215,27],[221,24,221,27],[225,15,225,17],[225,24,225,27],[51,9,51,11],[55,9,55,11],[56,9,56,11],[57,9,57,11],[68,9,68,11],[63,17,63,22],[233,15,233,17],[241,2,241,12],[241,17,241,30],[233,24,233,27],[237,15,237,17],[239,15,239,17],[239,24,239,27],[235,17,235,30],[237,5,237,9],[238,5,238,9],[239,5,239,9],[237,19,237,22],[238,19,238,22],[239,19,239,22],[84,24,84,25],[82,17,82,30],[85,24,85,25],[76,31,76,32],[86,24,86,25],[66,5,66,7],[67,5,67,7],[68,5,68,7],[61,2,61,12],[78,5,78,7],[78,24,78,25],[79,5,79,7],[73,5,73,7],[73,24,73,25],[76,2,76,12],[76,17,76,30],[74,5,74,7],[74,24,74,25],[63,9,63,11],[64,9,64,11],[66,9,66,11],[67,9,67,11],[70,31,70,32],[72,24,72,25],[80,5,80,7],[80,24,80,25],[84,5,84,7],[82,31,82,32],[90,24,90,25],[100,17,100,30],[100,31,100,32],[108,24,108,25],[110,24,110,25],[112,17,112,30],[144,21,144,29],[118,31,118,32],[121,24,121,25],[84,17,84,22],[94,31,94,32],[88,17,88,30],[88,31,88,32],[91,24,91,25],[92,24,92,25],[112,31,112,32],[109,24,109,25],[106,31,106,32],[96,24,96,25],[97,24,97,25],[98,24,98,25],[229,2,229,12],[198,19,198,25],[192,19,192,25],[211,24,211,27],[124,2,124,12],[124,17,124,30],[176,17,176,30],[176,31,176,32],[178,19,178,25],[128,24,128,25],[127,24,127,25],[141,2,141,12],[138,9,138,15],[139,9,139,15],[138,5,138,7],[135,5,135,7],[137,5,137,7],[135,9,135,15],[134,9,134,15],[134,5,134,7],[139,5,139,7],[170,17,170,30],[162,19,162,25],[164,2,164,12],[98,5,98,7],[50,5,50,7],[61,17,61,30],[226,24,226,27],[227,15,227,17],[227,24,227,27],[226,19,226,22],[227,19,227,22],[219,19,219,22],[220,19,220,22],[221,19,221,22],[225,19,225,22],[164,17,164,30],[139,17,139,19],[143,17,143,19],[143,21,143,29],[144,17,144,19],[79,24,79,25],[50,24,50,25],[51,24,51,25],[57,17,57,22],[50,17,50,22],[55,17,55,22],[56,17,56,22],[1,16,1,32],[8,24,8,25],[9,24,9,25],[35,2,35,12],[35,17,35,30],[35,31,35,32],[38,5,38,7],[70,2,70,12],[72,5,72,7],[63,5,63,7],[64,5,64,7],[63,24,63,25],[64,24,64,25],[47,2,47,12],[47,17,47,30],[57,5,57,7],[59,2,59,15],[53,31,53,32],[61,31,61,32],[49,24,49,25],[49,17,49,22],[59,16,59,32],[49,9,49,11],[50,9,50,11],[32,24,32,25],[33,24,33,25],[37,24,37,25],[38,24,38,25],[14,17,14,22],[15,9,15,11],[15,17,15,22],[37,9,37,11],[37,17,37,22],[14,9,14,11],[19,9,19,11],[19,17,19,22],[20,9,20,11],[20,17,20,22],[21,9,21,11],[38,9,38,11],[21,17,21,22],[25,9,25,11],[25,17,25,22],[26,9,26,11],[31,24,31,25],[27,5,27,7],[0,1,0,15],[0,16,0,33],[29,17,29,30],[29,31,29,32],[23,31,23,32],[23,2,23,12],[23,17,23,30],[17,2,17,12],[17,17,17,30],[15,5,15,7],[19,5,19,7],[20,5,20,7],[21,5,21,7],[17,31,17,32],[29,2,29,12],[13,5,13,7],[11,2,11,12],[25,5,25,7],[26,5,26,7],[14,5,14,7],[1,2,1,15],[13,9,13,11],[13,17,13,22],[11,31,11,32],[2,2,2,12],[2,17,2,30],[2,31,2,32],[4,5,4,7],[4,24,4,25],[5,24,5,25],[5,5,5,7],[7,5,7,7],[8,5,8,7],[9,5,9,7],[11,17,11,30],[4,17,4,22],[5,17,5,22],[7,17,7,22],[8,17,8,22],[9,17,9,22],[4,9,4,11],[5,9,5,11],[7,9,7,11],[8,9,8,11],[9,9,9,11],[7,24,7,25],[293,31,293,32],[296,5,296,7],[297,5,297,7],[291,5,291,7],[295,5,295,7],[287,17,287,30],[316,17,316,30],[295,27,295,29],[296,27,296,29],[297,27,297,29],[291,9,291,25],[291,27,291,29],[293,17,293,30],[290,5,290,7],[289,5,289,7],[301,17,301,30],[303,24,303,27],[306,24,306,27],[304,24,304,27],[303,7,303,9],[304,7,304,9],[278,31,278,32],[266,7,266,9],[266,24,266,25],[264,2,264,12],[264,17,264,30],[264,31,264,32],[270,2,270,12],[270,17,270,30],[270,31,270,32],[276,2,276,15],[276,17,276,32],[272,7,272,9],[266,19,266,22],[267,19,267,22],[268,19,268,22],[272,19,272,22],[273,19,273,22],[268,27,268,29],[266,27,266,29],[272,24,272,25],[272,27,272,29],[273,27,273,29],[274,24,274,25],[274,27,274,29],[331,3,331,12],[334,3,334,12],[332,3,332,12],[333,3,333,12],[274,7,274,9],[316,2,316,12],[295,9,295,25],[296,9,296,25],[297,9,297,25],[320,17,320,22],[331,15,331,31],[332,15,332,31],[333,15,333,31],[334,15,334,31],[316,31,316,32],[310,2,310,12],[310,17,310,30],[310,31,310,32],[314,24,314,27],[312,24,312,27],[313,24,313,27],[301,31,301,32],[287,31,287,32],[293,2,293,12],[182,17,182,30],[182,31,182,32],[132,17,132,30],[132,31,132,32],[141,31,141,32],[197,19,197,25],[188,31,188,32],[141,17,141,30],[147,31,147,32],[151,21,151,29],[138,21,138,29],[139,21,139,29],[138,17,138,19],[196,19,196,25],[179,19,179,25],[180,19,180,25],[190,19,190,25],[191,19,191,25],[185,19,185,25],[170,31,170,32],[167,19,167,25],[145,17,145,19],[145,21,145,29],[147,17,147,30],[320,24,320,27],[318,24,318,27],[308,24,308,27],[299,2,299,15],[299,16,299,32],[301,2,301,12],[307,7,307,9],[308,7,308,9],[303,13,303,15],[304,13,304,15],[306,13,306,15],[307,13,307,15],[308,13,308,15],[312,7,312,9],[312,13,312,15],[313,7,313,9],[313,13,313,15],[314,7,314,9],[314,13,314,15],[104,17,104,22],[108,9,108,11],[108,17,108,22],[110,5,110,7],[102,9,102,11],[102,17,102,22],[103,9,103,11],[106,17,106,30],[102,24,102,25],[103,24,103,25],[104,24,104,25],[108,5,108,7],[106,2,106,12],[273,7,273,9],[273,24,273,25],[191,9,191,13],[186,19,186,25],[188,2,188,12],[188,17,188,30],[243,24,243,27],[244,24,244,27],[251,27,251,29],[206,16,206,32],[194,17,194,30],[194,31,194,32],[258,31,258,32],[260,24,260,25],[251,24,251,25],[258,2,258,12],[229,17,229,30],[223,2,223,12],[223,17,223,30],[219,15,219,17],[219,24,219,27],[220,15,220,17],[220,24,220,27],[221,15,221,17],[168,19,168,25],[155,2,155,12],[155,17,155,30],[155,31,155,32],[157,19,157,25],[158,19,158,25],[160,19,160,25],[161,19,161,25],[96,5,96,7],[122,24,122,25],[126,5,126,7],[126,24,126,25],[115,5,115,7],[115,24,115,25],[118,2,118,12],[116,24,116,25],[120,5,120,7],[120,24,120,25],[114,5,114,7],[114,24,114,25],[100,2,100,12],[102,5,102,7],[103,5,103,7],[104,5,104,7],[249,31,249,32],[167,9,167,13],[168,9,168,13],[151,5,151,7],[151,9,151,15],[249,2,249,12],[245,15,245,17],[219,5,219,9],[220,5,220,9],[221,5,221,9],[225,5,225,9],[226,5,226,9],[227,5,227,9],[231,5,231,9],[232,5,232,9],[233,5,233,9],[214,5,214,9],[243,5,243,9],[243,15,243,17],[164,31,164,32],[166,19,166,25],[243,19,243,22],[153,2,153,15],[153,16,153,32],[150,5,150,7],[160,9,160,13],[161,9,161,13],[162,9,162,13],[166,9,166,13],[157,9,157,13],[203,9,203,13],[204,9,204,13],[174,9,174,13],[178,9,178,13],[179,9,179,13],[180,9,180,13],[198,9,198,13],[197,9,197,13],[170,2,170,12],[150,21,150,29],[151,17,151,19],[128,5,128,7],[210,5,210,9],[211,5,211,9],[213,5,213,9],[158,9,158,13],[143,5,143,7],[144,5,144,7],[145,5,145,7],[143,9,143,15],[144,9,144,15],[145,9,145,15],[184,9,184,13],[185,9,185,13],[186,9,186,13],[190,9,190,13],[182,2,182,12],[176,2,176,12],[172,9,172,13],[173,9,173,13],[149,9,149,15],[150,9,150,15],[149,5,149,7],[251,7,251,9],[262,24,262,25],[147,2,147,12],[192,9,192,13],[196,9,196,13],[194,2,194,12],[208,2,208,12],[244,15,244,17],[249,17,249,30],[258,17,258,30],[260,27,260,29],[252,27,252,29],[254,24,254,25],[255,24,255,25],[256,24,256,25],[254,27,254,29],[255,27,255,29],[245,24,245,27],[247,2,247,15],[247,16,247,32],[256,27,256,29],[260,7,260,9],[252,7,252,9],[254,7,254,9],[255,19,255,22],[261,7,261,9],[261,24,261,25],[261,27,261,29],[262,7,262,9],[262,27,262,29],[261,19,261,22],[262,19,262,22],[256,19,256,22],[260,19,260,22],[255,7,255,9],[256,7,256,9],[285,9,285,25],[289,9,289,25],[289,27,289,29],[290,9,290,25],[290,27,290,29],[280,27,280,29],[284,27,284,29],[285,27,285,29],[281,27,281,29],[283,9,283,25],[283,27,283,29],[26,17,26,22],[27,9,27,11],[27,17,27,22],[31,9,31,11],[31,17,31,22],[32,9,32,11],[32,17,32,22],[33,9,33,11],[33,17,33,22],[149,17,149,19],[149,21,149,29],[64,17,64,22],[66,17,66,22],[67,17,67,22],[68,17,68,22],[72,9,72,11],[72,17,72,22],[73,9,73,11],[73,17,73,22],[74,9,74,11],[74,17,74,22],[70,17,70,30],[78,9,78,11],[78,17,78,22],[79,9,79,11],[79,17,79,22],[80,9,80,11],[80,17,80,22],[84,9,84,11],[85,9,85,11],[85,17,85,22],[82,2,82,12],[85,5,85,7],[92,9,92,11],[92,17,92,22],[96,9,96,11],[96,17,96,22],[94,2,94,12],[94,17,94,30],[86,5,86,7],[97,9,97,11],[97,17,97,22],[92,5,92,7],[86,9,86,11],[86,17,86,22],[90,9,90,11],[90,17,90,22],[91,9,91,11],[91,17,91,22],[88,2,88,12],[91,5,91,7],[90,5,90,7],[97,5,97,7],[98,9,98,11],[98,17,98,22],[103,17,103,22],[109,9,109,11],[109,17,109,22],[110,9,110,11],[110,17,110,22],[132,2,132,12],[114,9,114,11],[114,17,114,22],[115,9,115,11],[115,17,115,22],[116,9,116,11],[116,17,116,22],[120,9,120,11],[120,17,120,22],[121,9,121,11],[121,17,121,22],[116,5,116,7],[118,17,118,30],[121,5,121,7],[112,2,112,12],[109,5,109,7],[104,9,104,11],[137,9,137,15],[130,2,130,15],[127,5,127,7],[122,5,122,7],[124,31,124,32],[231,19,231,22],[232,19,232,22],[233,19,233,22],[134,17,134,19],[135,17,135,19],[134,21,134,29],[135,21,135,29],[137,21,137,29],[122,9,122,11],[122,17,122,22],[126,9,126,11],[126,17,126,22],[127,9,127,11],[127,17,127,22],[128,9,128,11],[128,17,128,22],[130,16,130,32],[137,17,137,19],[150,17,150,19],[244,19,244,22],[245,19,245,22],[274,19,274,22],[287,2,287,12],[280,9,280,25],[281,9,281,25],[267,7,267,9],[267,27,267,29],[268,7,268,9],[280,5,280,7],[281,5,281,7],[283,5,283,7],[284,5,284,7],[285,5,285,7],[278,2,278,12],[278,17,278,30],[244,5,244,9],[245,5,245,9],[267,24,267,25],[268,24,268,25],[251,19,251,22],[252,19,252,22],[254,19,254,22],[284,9,284,25],[327,3,327,12],[328,3,328,12],[303,17,303,22],[304,17,304,22],[306,17,306,22],[307,17,307,22],[308,17,308,22],[312,17,312,22],[313,17,313,22],[314,17,314,22],[318,17,318,22],[319,7,319,9],[319,13,319,15],[320,7,320,9],[320,13,320,15],[306,7,306,9],[318,7,318,9],[318,13,318,15],[319,17,319,22],[329,3,329,12],[330,3,330,12],[319,24,319,27],[307,24,307,27],[335,15,335,31],[323,27,324,32],[323,2,324,5],[327,13,327,14],[328,13,328,14],[329,13,329,14],[330,13,330,14],[331,13,331,14],[332,13,332,14],[333,13,333,14],[334,13,334,14],[335,13,335,14],[326,15,326,31],[327,15,327,31],[328,15,328,31],[329,15,329,31],[330,15,330,31],[335,3,335,12],[326,3,326,12],[326,13,326,14]]}
[{"$f":"CONCATENATE(\"Equipe\",\" \",'2.Pré. Eq'!AN5)","v":"Equipe "},"  3. Rayonnement, visibilité et attractivité académique ",null,null,null,null,null,null,null,null,null,null,null,null,null,null,"3. الإشعاع، المقروئية و الاستقطاب الجامعي   ",null,null,null,null,null,null,null,null,null,null,null,null,null,null,null,null,null,{"$f":"CONCATENATE(\"فرقة\",\" \",'2.Pré. Eq'!AN5)","v":"فرقة "}]
[null,null,"a) Plénière ou tutorial à une conférence scientifique ou cours dans un workshop",null,null,null,null,null,null,null,null,null,null,null,null,null," أ) حصة علنية أو أعمال موجهة في محاضرة علمية أو درس في ورشة عمل"]
[null,null,"Exceptionnel : Congrès Mondial",null,null,null,null,null,null,null,null,null,null,null,null,"Exp+",null,"استثنائي: المؤتمر العالمي مع الأعمال المنشورة",null,null,null,null,null,null,null,null,null,null,null,null,null,"100 pts/نقطة"]
[]
[null,null,null,"رقم",null,"اسم المحاضرة",null,null,null,"عنوان المحاضرة",null,null,null,"السنة",null,"العنوان الإلكتروني",null,"اسم المشارك",null,null,null,null,null,null,"متدخل/غير متدخل",null,null,"مدعو/مشارك",null,"حصة",null,"القيمة"]
[null,null,null,"N°",null,"Nom de la Conférence",null,null,null,"Titre de la Conférence",null,null,null,"Année",null,"URL",null,"Nom  du participant",null,null,null,null,null,null,"O  / nO",null,null,"I /P",null,"%",null,"Valeur"]
[]
[null,null,null,1,null,null,null,null,null,null,null,null,null,null,null,null,null,null,null,null,null,null,null,null,null,null,null,null,null,{"$f":"IF(OR(Y8=\"\",AB8=\"\"),\"\",IF(Y8=\"Non Orateur\",IF(AB8=\"Proposée\",0.5*0.5,0.5*1),IF(AB8=\"Proposée\",0.5*1,1*1)))","v":""},null,{"$f":"IF(AD8=\"\",\"\",(100*AD8))","v":""},null,null,null,{"$f":"IF(OR(AF8=\"Valeur\",AF8=\"القيمة\"),0,IF(ISERROR(SEARCH(\"/\",AF8)),AF8,0))","v":""}]
[null,null,null,2,null,null,null,null,null,null,null,null,null,null,null,null,null,null,null,null,null,null,null,null,null,null,null,null,null,null,null,{"$f":"IF(AD9=\"\",\"\",(100*AD9))","v":""},null,null,null,{"$f":"IF(OR(AF9=\"Valeur\",AF9=\"القيمة\"),0,IF(ISERROR(SEARCH(\"/\",AF9)),AF9,0))","v":""}]
[null,null,null,3,null,null,null,null,null,null,null,null,null,null,null,null,null,null,null,null,null,null,null,null,null,null,null,null,null,null,null,"",null,null,null,{"$f":"IF(OR(AF10=\"Valeur\",AF10=\"القيمة\"),0,IF(ISERROR(SEARCH(\"/\",AF10)),AF10,0))","v":""},null,null,null,null,null,null,1]
[null,null,null,null,null,null,null,null,null,null,null,null,null,null,null,null,null,null,null,null,null,null,null,null,null,null,null,null,null,null,null,null,null,null,null,0]
[null,null,"Exceptionnel : Congrès continental",null,null,null,null,null,null,null,null,null,null,null,null,"Exp",null,"استثنائي : مؤتمر قاري",null,null,null,null,null,null,null,null,null,null,null,null,null,"50 pts/نقطة",null,null,null,0]
[null,null,null,null,null,null,null,null,null,null,null,null,null,null,null,null,null,null,null,null,null,null,null,null,null,null,null,null,null,null,null,null,null,null,null,0]
[null,null,null,1,null,null,null,null,null,null,null,null,null,null,null,null,null,null,null,null,null,null,null,null,null,null,null,null,null,{"$f":"IF(OR(Y14=\"\",AB14=\"\"),\"\",IF(Y14=\"Non Orateur\",IF(AB14=\"Proposée\",0.5*0.5,0.5*1),IF(AB14=\"Proposée\",0.5*1,1*1)))","v":""},null,{"$f":"IF(AD14=\"\",\"\",(50*AD14))","v":""},null,null,null,""]
[null,null,null,2,null,null,null,null,null,null,null,null,null,null,null,null,null,null,null,null,null,null,null,null,null,null,null,null,null,null,null,{"$f":"IF(AD15=\"\",\"\",(50*AD15))","v":""},null,null,null,""]
[null,null,null,3,null,null,null,null,null,null,null,null,null,null,null,null,null,null,null,null,null,null,null,null,null,null,null,null,null,null,null,"",null,null,null,"",null,null,null,null,null,null,null,2]
[null,null,null,null,null,null,null,null,null,null,null,null,null,null,null,null,null,null,null,null,null,null,null,null,null,null,null,null,null,null,null,null,null,null,null,0]
[null,null,"Conférence Mobile (2 continents) avec actes dans le WOS",null,null,null,null,null,null,null,null,null,null,null,null,"A+",null,"محاضرة متنقلة (قارتين) مع الأعمال المنشورة ضمن WOS",null,null,null,null,null,null,null,null,null,null,null,null,null,"40 pts/نقطة",null,null,null,0]
[null,null,null,null,null,null,null,null,null,null,null,null,null,null,null,null,null,null,null,null,null,null,null,null,null,null,null,null,null,null,null,null,null,null,null,0]
[null,null,null,1,null,null,null,null,null,null,null,null,null,null,null,null,null,null,null,null,null,null,null,null,null,null,null,null,null,{"$f":"IF(OR(Y20=\"\",AB20=\"\"),\"\",IF(Y20=\"Non Orateur\",IF(AB20=\"Proposée\",0.5*0.5,0.5*1),IF(AB20=\"Proposée\",0.5*1,1*1)))","v":""},null,{"$f":"IF(AD20=\"\",\"\",(40*AD20))","v":""},null,null,null,""]
[null,null,null,2,null,null,null,null,null,null,null,null,null,null,null,null,null,null,null,null,null,null,null,null,null,null,null,null,null,null,null,{"$f":"IF(AD21=\"\",\"\",(40*AD21))","v":""},null,null,null,""]
[null,null,null,3,null,null,null,null,null,null,null,null,null,null,null,null,null,null,null,null,null,null,null,null,null,null,null,null,null,null,null,"",null,null,null,"",null,null,null,null,null,null,null,null,3]
[null,null,null,null,null,null,null,null,null,null,null,null,null,null,null,null,null,null,null,null,null,null,null,null,null,null,null,null,null,null,null,null,null,null,null,0]
[null,null,"Conférence Mobile avec actes (2 continents)",null,null,null,null,null,null,null,null,null,null,null,null,"A",null,"محاضرة متنقلة مع الأعمال المنشورة (قارتان)",null,null,null,null,null,null,null,null,null,null,null,null,null,"25 pts/نقطة",null,null,null,0]
[null,null,null,null,null,null,null,null,null,null,null,null,null,null,null,null,null,null,null,null,null,null,null,null,null,null,null,null,null,null,null,null,null,null,null,0]
[null,null,null,1,null,null,null,null,null,null,null,null,null,null,null,null,null,null,null,null,null,null,null,null,null,null,null,null,null,{"$f":"IF(OR(Y26=\"\",AB26=\"\"),\"\",IF(Y26=\"Non Orateur\",IF(AB26=\"Proposée\",0.5*0.5,0.5*1),IF(AB26=\"Proposée\",0.5*1,1*1)))","v":""},null,{"$f":"IF(AD26=\"\",\"\",(25*AD26))","v":""},null,null,null,""]
[null,null,null,2,null,null,null,null,null,null,null,null,null,null,null,null,null,null,null,null,null,null,null,null,null,null,null,null,null,null,null,{"$f":"IF(AD27=\"\",\"\",(25*AD27))","v":""},null,null,null,""]
[null,null,null,3,null,null,null,null,null,null,null,null,null,null,null,null,null,null,null,null,null,null,null,null,null,null,null,null,null,null,null,"",null,null,null,"",null,null,null,null,null,null,null,null,null,4]
[null,null,null,null,null,null,null,null,null,null,null,null,null,null,null,null,null,null,null,null,null,null,null,null,null,null,null,null,null,null,null,null,null,null,null,0]
[null,null,"Conférence Mobile continentale avec actes dans le WOS",null,null,null,null,null,null,null,null,null,null,null,null,"B+",null,"محاضرة متنقلة قارية مع الأعمال المنشورة ضمن WOS",null,null,null,null,null,null,null,null,null,null,null,null,null,"30 pts/نقطة",null,null,null,0]
[null,null,null,null,null,null,null,null,null,null,null,null,null,null,null,null,null,null,null,null,null,null,null,null,null,null,null,null,null,null,null,null,null,null,null,0]
[null,null,null,1,null,null,null,null,null,null,null,null,null,null,null,null,null,null,null,null,null,null,null,null,null,null,null,null,null,{"$f":"IF(OR(Y32=\"\",AB32=\"\"),\"\",IF(Y32=\"Non Orateur\",IF(AB32=\"Proposée\",0.5*0.5,0.5*1),IF(AB32=\"Proposée\",0.5*1,1*1)))","v":""},null,{"$f":"IF(AD32=\"\",\"\",(30*AD32))","v":""},null,null,null,""]
[null,null,null,2,null,null,null,null,null,null,null,null,null,null,null,null,null,null,null,null,null,null,null,null,null,null,null,null,null,null,null,{"$f":"IF(AD33=\"\",\"\",(30*AD33))","v":""},null,null,null,""]
[null,null,null,3,null,null,null,null,null,null,null,null,null,null,null,null,null,null,null,null,null,null,null,null,null,null,null,null,null,null,null,"",null,null,null,"",null,null,null,null,null,null,null,null,null,null,5]
[null,null,null,null,null,null,null,null,null,null,null,null,null,null,null,null,null,null,null,null,null,null,null,null,null,null,null,null,null,null,null,null,null,null,null,0]
[null,null,"Conférence Mobile continentale avec actes",null,null,null,null,null,null,null,null,null,null,null,null,"B",null,"محاضرة متنقلة قارية مع الأعمال المنشورة",null,null,null,null,null,null,null,null,null,null,null,null,null,"20 pts/نقطة",null,null,null,0]
[null,null,null,null,null,null,null,null,null,null,null,null,null,null,null,null,null,null,null,null,null,null,null,null,null,null,null,null,null,null,null,null,null,null,null,0]
[null,null,null,1,null,null,null,null,null,null,null,null,null,null,null,null,null,null,null,null,null,null,null,null,null,null,null,null,null,{"$f":"IF(OR(Y38=\"\",AB38=\"\"),\"\",IF(Y38=\"Non Orateur\",IF(AB38=\"Proposée\",0.5*0.5,0.5*1),IF(AB38=\"Proposée\",0.5*1,1*1)))","v":""},null,{"$f":"IF(AD38=\"\",\"\",(20*AD38))","v":""},null,null,null,""]
[null,null,null,2,null,null,null,null,null,null,null,null,null,null,null,null,null,null,null,null,null,null,null,null,null,null,null,null,null,null,null,{"$f":"IF(AD39=\"\",\"\",(20*AD39))","v":""},null,null,null,""]
[null,null,null,3,null,null,null,null,null,null,null,null,null,null,null,null,null,null,null,null,null,null,null,null,null,null,null,null,null,null,null,"",null,null,null,"",null,null,null,null,null,null,null,null,null,null,null,6]
[null,null,null,null,null,null,null,null,null,null,null,null,null,null,null,null,null,null,null,null,null,null,null,null,null,null,null,null,null,null,null,null,null,null,null,0]
[null,null,"Conférence avec actes dans le WOS",null,null,null,null,null,null,null,null,null,null,null,null,"C+",null,"محاضرة مع الأعمال المنشورة ضمن WOS",null,null,null,null,null,null,null,null,null,null,null,null,null,"25 pts/نقطة",null,null,null,0]
[null,null,null,null,null,null,null,null,null,null,null,null,null,null,null,null,null,null,null,null,null,null,null,null,null,null,null,null,null,null,null,null,null,null,null,0]
[null,null,null,1,null,null,null,null,null,null,null,null,null,null,null,null,null,null,null,null,null,null,null,null,null,null,null,null,null,{"$f":"IF(OR(Y44=\"\",AB44=\"\"),\"\",IF(Y44=\"Non Orateur\",IF(AB44=\"Proposée\",0.5*0.5,0.5*1),IF(AB44=\"Proposée\",0.5*1,1*1)))","v":""},null,{"$f":"IF(AD44=\"\",\"\",(25*AD44))","v":""},null,null,null,""]
[null,null,null,2,null,null,null,null,null,null,null,null,null,null,null,null,null,null,null,null,null,null,null,null,null,null,null,null,null,null,null,{"$f":"IF(AD45=\"\",\"\",(25*AD45))","v":""},null,null,null,""]
[null,null,null,3,null,null,null,null,null,null,null,null,null,null,null,null,null,null,null,null,null,null,null,null,null,null,null,null,null,null,null,"",null,null,null,"",null,null,null,null,null,null,null,null,null,null,null,null,7]
[null,null,null,null,null,null,null,null,null,null,null,null,null,null,null,null,null,null,null,null,null,null,null,null,null,null,null,null,null,null,null,null,null,null,null,0]
[null,null,"Conférence internationale avec actes",null,null,null,null,null,null,null,null,null,null,null,null,"C",null,"محاضرة دولية مع الأعمال المنشورة",null,null,null,null,null,null,null,null,null,null,null,null,null,"15 pts/نقطة",null,null,null,0]
[null,null,null,null,null,null,null,null,null,null,null,null,null,null,null,null,null,null,null,null,null,null,null,null,null,null,null,null,null,null,null,null,null,null,null,0]
[null,null,null,1,null,null,null,null,null,null,null,null,null,null,null,null,null,null,null,null,null,null,null,null,null,null,null,null,null,{"$f":"IF(OR(Y50=\"\",AB50=\"\"),\"\",IF(Y50=\"Non Orateur\",IF(AB50=\"Proposée\",0.5*0.5,0.5*1),IF(AB50=\"Proposée\",0.5*1,1*1)))","v":""},null,{"$f":"IF(AD50=\"\",\"\",(15*AD50))","v":""},null,null,null,""]
[null,null,null,2,null,null,null,null,null,null,null,null,null,null,null,null,null,null,null,null,null,null,null,null,null,null,null,null,null,null,null,{"$f":"IF(AD51=\"\",\"\",(15*AD51))","v":""},null,null,null,""]
[null,null,null,3,null,null,null,null,null,null,null,null,null,null,null,null,null,null,null,null,null,null,null,null,null,null,null,null,null,null,null,"",null,null,null,"",null,null,null,null,null,null,null,null,null,null,null,null,null,8]
[null,null,null,null,null,null,null,null,null,null,null,null,null,null,null,null,null,null,null,null,null,null,null,null,null,null,null,null,null,null,null,null,null,null,null,0]
[null,null,"Conférence nationale avec actes",null,null,null,null,null,null,null,null,null,null,null,null,"D",null," محاضرة وطنية مع الأعمال المنشورة",null,null,null,null,null,null,null,null,null,null,null,null,null,"10 pts/نقطة",null,null,null,0]
[null,null,null,null,null,null,null,null,null,null,null,null,null,null,null,null,null,null,null,null,null,null,null,null,null,null,null,null,null,null,null,null,null,null,null,0]
[null,null,null,1,null,null,null,null,null,null,null,null,null,null,null,null,null,null,null,null,null,null,null,null,null,null,null,null,null,{"$f":"IF(OR(Y56=\"\",AB56=\"\"),\"\",IF(Y56=\"Non Orateur\",IF(AB56=\"Proposée\",0.5*0.5,0.5*1),IF(AB56=\"Proposée\",0.5*1,1*1)))","v":""},null,{"$f":"IF(AD56=\"\",\"\",(10*AD56))","v":""},null,null,null,""]
[null,null,null,2,null,null,null,null,null,null,null,null,null,null,null,null,null,null,null,null,null,null,null,null,null,null,null,null,null,null,null,{"$f":"IF(AD57=\"\",\"\",(10*AD57))","v":""},null,null,null,""]
[null,null,null,3,null,null,null,null,null,null,null,null,null,null,null,null,null,null,null,null,null,null,null,null,null,null,null,null,null,null,null,"",null,null,null,"",null,null,null,null,null,null,null,null,null,null,null,null,null,null,9]
[null,null,null,null,null,null,null,null,null,null,null,null,null,null,null,null,null,null,null,null,null,null,null,null,null,null,null,null,null,null,null,null,null,null,null,0]
[null,null," b) Communication à une conférence scientifique",null,null,null,null,null,null,null,null,null,null,null,null,null,"ب) مداخلة ضمن محاضرة علمية",null,null,null,null,null,null,null,null,null,null,null,null,null,null,null,null,null,null,0]
[null,null,null,null,null,null,null,null,null,null,null,null,null,null,null,null,null,null,null,null,null,null,null,null,null,null,null,null,null,null,null,null,null,null,null,0]
[null,null,"Exceptionnel : Communication à un Congrès Mondial",null,null,null,null,null,null,null,null,null,null,null,null,"Exp+",null,"استثنائي :مداخلة ضمن مؤتمر عالمي",null,null,null,null,null,null,null,null,null,null,null,null,null,"30 pts/نقطة",null,null,null,0]
[null,null,null,null,null,null,null,null,null,null,null,null,null,null,null,null,null,null,null,null,null,null,null,null,null,null,null,null,null,null,null,null,null,null,null,0]
[null,null,null,"رقم",null,"اسم المحاضرة",null,null,null,"عنوان المحاضرة",null,null,null,"السنة",null,"العنوان الإلكتروني",null,"اسم المشارك",null,null,null,null,null,null,"متدخل/غير متدخل",null,null,"مداخلة/جدارية",null,"حصة",null,"القيمة",null,null,null,0]
[null,null,null,"N°",null,"Nom de la Conférence",null,null,null,"Titre de la Conférence",null,null,null,"Année",null,"URL",null,"Nom  du participant",null,null,null,null,null,null,"O  / nO",null,null,"O /P",null,"%",null,"Valeur",null,null,null,0]
[null,null,null,null,null,null,null,null,null,null,null,null,null,null,null,null,null,null,null,null,null,null,null,null,null,null,null,null,null,null,null,null,null,null,null,0]
[null,null,null,1,null,null,null,null,null,null,null,null,null,null,null,null,null,null,null,null,null,null,null,null,null,null,null,null,null,{"$f":"IF(OR(Y67=\"\",AB67=\"\"),\"\",IF(Y67=\"Non Orateur\",IF(AB67=\"Poster\",0.5*0.5,0.5*1),IF(AB67=\"Poster\",0.5*1,1*1)))","v":""},null,{"$f":"IF(AD67=\"\",\"\",(30*AD67))","v":""},null,null,null,""]
[null,null,null,2,null,null,null,null,null,null,null,null,null,null,null,null,null,null,null,null,null,null,null,null,null,null,null,null,null,{"$f":"IF(OR(Y68=\"\",AB68=\"\"),\"\",IF(Y68=\"Non Orateur\",IF(AB68=\"Poster\",0.5*0.5,0.5*1),IF(AB68=\"Poster\",0.5*1,1*1)))","v":""},null,{"$f":"IF(AD68=\"\",\"\",(30*AD68))","v":""},null,null,null,""]
[null,null,null,3,null,null,null,null,null,null,null,null,null,null,null,null,null,null,null,null,null,null,null,null,null,null,null,null,null,"",null,"",null,null,null,"",null,null,null,null,null,null,null,null,null,null,null,null,null,null,null,10]
[null,null,null,null,null,null,null,null,null,null,null,null,null,null,null,null,null,null,null,null,null,null,null,null,null,null,null,null,null,null,null,null,null,null,null,0]
[null,null,"Exceptionnel: Communication à un Congrès Continental",null,null,null,null,null,null,null,null,null,null,null,null,"Exp",null," استثنائي :مداخلة ضمن مؤتمر قاري",null,null,null,null,null,null,null,null,null,null,null,null,null,"20 pts/نقطة",null,null,null,0]
[null,null,null,null,null,null,null,null,null,null,null,null,null,null,null,null,null,null,null,null,null,null,null,null,null,null,null,null,null,null,null,null,null,null,null,0]
[null,null,null,1,null,null,null,null,null,null,null,null,null,null,null,null,null,null,null,null,null,null,null,null,null,null,null,null,null,{"$f":"IF(OR(Y73=\"\",AB73=\"\"),\"\",IF(Y73=\"Non Orateur\",IF(AB73=\"Poster\",0.5*0.5,0.5*1),IF(AB73=\"Poster\",0.5*1,1*1)))","v":""},null,{"$f":"IF(AD73=\"\",\"\",(20*AD73))","v":""},null,null,null,""]
[null,null,null,2,null,null,null,null,null,null,null,null,null,null,null,null,null,null,null,null,null,null,null,null,null,null,null,null,null,{"$f":"IF(OR(Y74=\"\",AB74=\"\"),\"\",IF(Y74=\"Non Orateur\",IF(AB74=\"Poster\",0.5*0.5,0.5*1),IF(AB74=\"Poster\",0.5*1,1*1)))","v":""},null,{"$f":"IF(AD74=\"\",\"\",(20*AD74))","v":""},null,null,null,{"$f":"IF(OR(AF74=\"Valeur\",AF74=\"القيمة\"),0,IF(ISERROR(SEARCH(\"/\",AF74)),AF74,0))","v":""}]
[null,null,null,3,null,null,null,null,null,null,null,null,null,null,null,null,null,null,null,null,null,null,null,null,null,null,null,null,null,"",null,"",null,null,null,"",null,null,null,null,null,null,null,null,null,null,null,null,null,null,null,null,11]
[null,null,null,null,null,null,null,null,null,null,null,null,null,null,null,null,null,null,null,null,null,null,null,null,null,null,null,null,null,null,null,null,null,null,null,0]
[null,null,"Communication à une Conférence Mobile avec actes dans le WOS",null,null,null,null,null,null,null,null,null,null,null,null,"A+",null,"مداخلة ضمن محاضرة متنقلة مع الأعمال المنشورة WOS",null,null,null,null,null,null,null,null,null,null,null,null,null,"15 pts/نقطة",null,null,null,0]
[null,null,null,null,null,null,null,null,null,null,null,null,null,null,null,null,null,null,null,null,null,null,null,null,null,null,null,null,null,null,null,null,null,null,null,0]
[null,null,null,1,null,null,null,null,null,null,null,null,null,null,null,null,null,null,null,null,null,null,null,null,null,null,null,null,null,{"$f":"IF(OR(Y79=\"\",AB79=\"\"),\"\",IF(Y79=\"Non Orateur\",IF(AB79=\"Poster\",0.5*0.5,0.5*1),IF(AB79=\"Poster\",0.5*1,1*1)))","v":""},null,{"$f":"IF(AD79=\"\",\"\",(15*AD79))","v":""},null,null,null,""]
[null,null,null,2,null,null,null,null,null,null,null,null,null,null,null,null,null,null,null,null,null,null,null,null,null,null,null,null,null,{"$f":"IF(OR(Y80=\"\",AB80=\"\"),\"\",IF(Y80=\"Non Orateur\",IF(AB80=\"Poster\",0.5*0.5,0.5*1),IF(AB80=\"Poster\",0.5*1,1*1)))","v":""},null,{"$f":"IF(AD80=\"\",\"\",(15*AD80))","v":""},null,null,null,""]
[null,null,null,3,null,null,null,null,null,null,null,null,null,null,null,null,null,null,null,null,null,null,null,null,null,null,null,null,null,"",null,"",null,null,null,"",null,null,null,null,null,null,null,null,null,null,null,null,null,null,null,null,null,12]
[null,null,null,null,null,null,null,null,null,null,null,null,null,null,null,null,null,null,null,null,null,null,null,null,null,null,null,null,null,null,null,null,null,null,null,0]
[null,null,"Communication à une Conférence Mobile avec actes (2 continents)",null,null,null,null,null,null,null,null,null,null,null,null,"A",null,"مداخلة ضمن محاضرة متنقلة مع الأعمال المنشورة (قارتين)",null,null,null,null,null,null,null,null,null,null,null,null,null,"12 pts/نقطة",null,null,null,0]
[null,null,null,null,null,null,null,null,null,null,null,null,null,null,null,null,null,null,null,null,null,null,null,null,null,null,null,null,null,null,null,null,null,null,null,0]
[null,null,null,1,null,null,null,null,null,null,null,null,null,null,null,null,null,null,null,null,null,null,null,null,null,null,null,null,null,{"$f":"IF(OR(Y85=\"\",AB85=\"\"),\"\",IF(Y85=\"Non Orateur\",IF(AB85=\"Poster\",0.5*0.5,0.5*1),IF(AB85=\"Poster\",0.5*1,1*1)))","v":""},null,{"$f":"IF(AD85=\"\",\"\",(12*AD85))","v":""},null,null,null,""]
[null,null,null,2,null,null,null,null,null,null,null,null,null,null,null,null,null,null,null,null,null,null,null,null,null,null,null,null,null,{"$f":"IF(OR(Y86=\"\",AB86=\"\"),\"\",IF(Y86=\"Non Orateur\",IF(AB86=\"Poster\",0.5*0.5,0.5*1),IF(AB86=\"Poster\",0.5*1,1*1)))","v":""},null,{"$f":"IF(AD86=\"\",\"\",(12*AD86))","v":""},null,null,null,""]
[null,null,null,3,null,null,null,null,null,null,null,null,null,null,null,null,null,null,null,null,null,null,null,null,null,null,null,null,null,"",null,"",null,null,null,"",null,null,null,null,null,null,null,null,null,null,null,null,null,null,null,null,null,null,13]
[null,null,null,null,null,null,null,null,null,null,null,null,null,null,null,null,null,null,null,null,null,null,null,null,null,null,null,null,null,null,null,null,null,null,null,0]
[null,null,"Conférence Mobile continentale avec actes dans le WOS",null,null,null,null,null,null,null,null,null,null,null,null,"B+",null,"محاضرة متنقلة قارية مع الأعمال المنشورة ضمن WOS",null,null,null,null,null,null,null,null,null,null,null,null,null,"12 pts/نقطة",null,null,null,0]
[null,null,null,null,null,null,null,null,null,null,null,null,null,null,null,null,null,null,null,null,null,null,null,null,null,null,null,null,null,null,null,null,null,null,null,0]
[null,null,null,1,null,null,null,null,null,null,null,null,null,null,null,null,null,null,null,null,null,null,null,null,null,null,null,null,null,{"$f":"IF(OR(Y91=\"\",AB91=\"\"),\"\",IF(Y91=\"Non Orateur\",IF(AB91=\"Poster\",0.5*0.5,0.5*1),IF(AB91=\"Poster\",0.5*1,1*1)))","v":""},null,{"$f":"IF(AD91=\"\",\"\",(12*AD91))","v":""},null,null,null,""]
[null,null,null,2,null,null,null,null,null,null,null,null,null,null,null,null,null,null,null,null,null,null,null,null,null,null,null,null,null,{"$f":"IF(OR(Y92=\"\",AB92=\"\"),\"\",IF(Y92=\"Non Orateur\",IF(AB92=\"Poster\",0.5*0.5,0.5*1),IF(AB92=\"Poster\",0.5*1,1*1)))","v":""},null,{"$f":"IF(AD92=\"\",\"\",(12*AD92))","v":""},null,null,null,""]
[null,null,null,3,null,null,null,null,null,null,null,null,null,null,null,null,null,null,null,null,null,null,null,null,null,null,null,null,null,"",null,"",null,null,null,"",null,null,null,null,null,null,null,null,null,null,null,null,null,null,null,null,null,null,null,14]
[null,null,null,null,null,null,null,null,null,null,null,null,null,null,null,null,null,null,null,null,null,null,null,null,null,null,null,null,null,null,null,null,null,null,null,0]
[null,null,"Conférence Mobile continentale avec actes",null,null,null,null,null,null,null,null,null,null,null,null,"B",null,"محاضرة متنقلة قارية مع الأعمال المنشورة",null,null,null,null,null,null,null,null,null,null,null,null,null,"10 pts/نقطة",null,null,null,0]
[null,null,null,null,null,null,null,null,null,null,null,null,null,null,null,null,null,null,null,null,null,null,null,null,null,null,null,null,null,null,null,null,null,null,null,0]
[null,null,null,1,null,null,null,null,null,null,null,null,null,null,null,null,null,null,null,null,null,null,null,null,null,null,null,null,null,{"$f":"IF(OR(Y97=\"\",AB97=\"\"),\"\",IF(Y97=\"Non Orateur\",IF(AB97=\"Poster\",0.5*0.5,0.5*1),IF(AB97=\"Poster\",0.5*1,1*1)))","v":""},null,{"$f":"IF(AD97=\"\",\"\",(10*AD97))","v":""},null,null,null,""]
[null,null,null,2,null,null,null,null,null,null,null,null,null,null,null,null,null,null,null,null,null,null,null,null,null,null,null,null,null,{"$f":"IF(OR(Y98=\"\",AB98=\"\"),\"\",IF(Y98=\"Non Orateur\",IF(AB98=\"Poster\",0.5*0.5,0.5*1),IF(AB98=\"Poster\",0.5*1,1*1)))","v":""},null,{"$f":"IF(AD98=\"\",\"\",(10*AD98))","v":""},null,null,null,""]
[null,null,null,3,null,null,null,null,null,null,null,null,null,null,null,null,null,null,null,null,null,null,null,null,null,null,null,null,null,"",null,"",null,null,null,"",null,null,null,null,null,null,null,null,null,null,null,null,null,null,null,null,null,null,null,null,15]
[null,null,null,null,null,null,null,null,null,null,null,null,null,null,null,null,null,null,null,null,null,null,null,null,null,null,null,null,null,null,null,null,null,null,null,0]
[null,null,"Communication à une Conférence avec actes dans le WOS",null,null,null,null,null,null,null,null,null,null,null,null,"C+",null,"مداخلة ضمن محاضرة مع الأعمال المنشورة ضمن WOS",null,null,null,null,null,null,null,null,null,null,null,null,null,"10 pts/نقطة",null,null,null,0]
[null,null,null,null,null,null,null,null,null,null,null,null,null,null,null,null,null,null,null,null,null,null,null,null,null,null,null,null,null,null,null,null,null,null,null,0]
[null,null,null,1,null,null,null,null,null,null,null,null,null,null,null,null,null,null,null,null,null,null,null,null,null,null,null,null,null,{"$f":"IF(OR(Y103=\"\",AB103=\"\"),\"\",IF(Y103=\"Non Orateur\",IF(AB103=\"Poster\",0.5*0.5,0.5*1),IF(AB103=\"Poster\",0.5*1,1*1)))","v":""},null,{"$f":"IF(AD103=\"\",\"\",(10*AD103))","v":""},null,null,null,""]
[null,null,null,2,null,null,null,null,null,null,null,null,null,null,null,null,null,null,null,null,null,null,null,null,null,null,null,null,null,{"$f":"IF(OR(Y104=\"\",AB104=\"\"),\"\",IF(Y104=\"Non Orateur\",IF(AB104=\"Poster\",0.5*0.5,0.5*1),IF(AB104=\"Poster\",0.5*1,1*1)))","v":""},null,{"$f":"IF(AD104=\"\",\"\",(10*AD104))","v":""},null,null,null,""]
[null,null,null,3,null,null,null,null,null,null,null,null,null,null,null,null,null,null,null,null,null,null,null,null,null,null,null,null,null,"",null,"",null,null,null,"",null,null,null,null,null,null,null,null,null,null,null,null,null,null,null,null,null,null,null,null,null,16]
[null,null,null,null,null,null,null,null,null,null,null,null,null,null,null,null,null,null,null,null,null,null,null,null,null,null,null,null,null,null,null,null,null,null,null,0]
[null,null,"Communication à une Conférence internationale avec acte",null,null,null,null,null,null,null,null,null,null,null,null,"C",null,"مداخلة ضمن محاضرة دولية مع الأعمال المنشورة",null,null,null,null,null,null,null,null,null,null,null,null,null,"8 pts/نقطة",null,null,null,0]
[null,null,null,null,null,null,null,null,null,null,null,null,null,null,null,null,null,null,null,null,null,null,null,null,null,null,null,null,null,null,null,null,null,null,null,0]
[null,null,null,1,null,null,null,null,null,null,null,null,null,null,null,null,null,null,null,null,null,null,null,null,null,null,null,null,null,{"$f":"IF(OR(Y109=\"\",AB109=\"\"),\"\",IF(Y109=\"Non Orateur\",IF(AB109=\"Poster\",0.5*0.5,0.5*1),IF(AB109=\"Poster\",0.5*1,1*1)))","v":""},null,{"$f":"IF(AD109=\"\",\"\",(8*AD109))","v":""},null,null,null,""]
[null,null,null,2,null,null,null,null,null,null,null,null,null,null,null,null,null,null,null,null,null,null,null,null,null,null,null,null,null,{"$f":"IF(OR(Y110=\"\",AB110=\"\"),\"\",IF(Y110=\"Non Orateur\",IF(AB110=\"Poster\",0.5*0.5,0.5*1),IF(AB110=\"Poster\",0.5*1,1*1)))","v":""},null,{"$f":"IF(AD110=\"\",\"\",(8*AD110))","v":""},null,null,null,""]
[null,null,null,3,null,null,null,null,null,null,null,null,null,null,null,null,null,null,null,null,null,null,null,null,null,null,null,null,null,"",null,"",null,null,null,"",null,null,null,null,null,null,null,null,null,null,null,null,null,null,null,null,null,null,null,null,null,null,17]
[null,null,null,null,null,null,null,null,null,null,null,null,null,null,null,null,null,null,null,null,null,null,null,null,null,null,null,null,null,null,null,null,null,null,null,0]
[null,null,"Communication à une Conférence nationale avec actes",null,null,null,null,null,null,null,null,null,null,null,null,"D",null,"مداخلة ضمن محاضرة وطنية مع الأعمال المنشورة",null,null,null,null,null,null,null,null,null,null,null,null,null,"6 pts/نقطة",null,null,null,0]
[null,null,null,null,null,null,null,null,null,null,null,null,null,null,null,null,null,null,null,null,null,null,null,null,null,null,null,null,null,null,null,null,null,null,null,0]
[null,null,null,1,null,null,null,null,null,null,null,null,null,null,null,null,null,null,null,null,null,null,null,null,null,null,null,null,null,{"$f":"IF(OR(Y115=\"\",AB115=\"\"),\"\",IF(Y115=\"Non Orateur\",IF(AB115=\"Poster\",0.5*0.5,0.5*1),IF(AB115=\"Poster\",0.5*1,1*1)))","v":""},null,{"$f":"IF(AD115=\"\",\"\",(6*AD115))","v":""},null,null,null,""]
[null,null,null,2,null,null,null,null,null,null,null,null,null,null,null,null,null,null,null,null,null,null,null,null,null,null,null,null,null,{"$f":"IF(OR(Y116=\"\",AB116=\"\"),\"\",IF(Y116=\"Non Orateur\",IF(AB116=\"Poster\",0.5*0.5,0.5*1),IF(AB116=\"Poster\",0.5*1,1*1)))","v":""},null,{"$f":"IF(AD116=\"\",\"\",(6*AD116))","v":""},null,null,null,""]
[null,null,null,3,null,null,null,null,null,null,null,null,null,null,null,null,null,null,null,null,null,null,null,null,null,null,null,null,null,"",null,"",null,null,null,"",null,null,null,null,null,null,null,null,null,null,null,null,null,null,null,null,null,null,null,null,null,null,null,18]
[null,null,null,null,null,null,null,null,null,null,null,null,null,null,null,null,null,null,null,null,null,null,null,null,null,null,null,null,null,null,null,null,null,null,null,0]
[null,null,"Séminaires périodiques (officiels)",null,null,null,null,null,null,null,null,null,null,null,null,"E",null,"ملتقيات منتظمة (رسمية)",null,null,null,null,null,null,null,null,null,null,null,null,null,"2 pts/نقطة",null,null,null,0]
[null,null,null,null,null,null,null,null,null,null,null,null,null,null,null,null,null,null,null,null,null,null,null,null,null,null,null,null,null,null,null,null,null,null,null,0]
[null,null,null,1,null,null,null,null,null,null,null,null,null,null,null,null,null,null,null,null,null,null,null,null,null,null,null,null,null,{"$f":"IF(OR(Y121=\"\",AB121=\"\"),\"\",IF(Y121=\"Non Orateur\",IF(AB121=\"Poster\",0.5*0.5,0.5*1),IF(AB121=\"Poster\",0.5*1,1*1)))","v":""},null,{"$f":"IF(AD121=\"\",\"\",(2*AD121))","v":""},null,null,null,""]
[null,null,null,2,null,null,null,null,null,null,null,null,null,null,null,null,null,null,null,null,null,null,null,null,null,null,null,null,null,{"$f":"IF(OR(Y122=\"\",AB122=\"\"),\"\",IF(Y122=\"Non Orateur\",IF(AB122=\"Poster\",0.5*0.5,0.5*1),IF(AB122=\"Poster\",0.5*1,1*1)))","v":""},null,{"$f":"IF(AD122=\"\",\"\",(2*AD122))","v":""},null,null,null,""]
[null,null,null,3,null,null,null,null,null,null,null,null,null,null,null,null,null,null,null,null,null,null,null,null,null,null,null,null,null,"",null,"",null,null,null,"",null,null,null,null,null,null,null,null,null,null,null,null,null,null,null,null,null,null,null,null,null,null,null,null,19]
[null,null,null,null,null,null,null,null,null,null,null,null,null,null,null,null,null,null,null,null,null,null,null,null,null,null,null,null,null,null,null,null,null,null,null,0]
[null,null,"Journées d’études",null,null,null,null,null,null,null,null,null,null,null,null,null,null,"أيام دراسية",null,null,null,null,null,null,null,null,null,null,null,null,null,"2 pts/نقطة",null,null,null,0]
[null,null,null,null,null,null,null,null,null,null,null,null,null,null,null,null,null,null,null,null,null,null,null,null,null,null,null,null,null,null,null,null,null,null,null,0]
[null,null,null,1,null,null,null,null,null,null,null,null,null,null,null,null,null,null,null,null,null,null,null,null,null,null,null,null,null,{"$f":"IF(OR(Y127=\"\",AB127=\"\"),\"\",IF(Y127=\"Non Orateur\",IF(AB127=\"Poster\",0.5*0.5,0.5*1),IF(AB127=\"Poster\",0.5*1,1*1)))","v":""},null,{"$f":"IF(AD127=\"\",\"\",(2*AD127))","v":""},null,null,null,""]
[null,null,null,2,null,null,null,null,null,null,null,null,null,null,null,null,null,null,null,null,null,null,null,null,null,null,null,null,null,{"$f":"IF(OR(Y128=\"\",AB128=\"\"),\"\",IF(Y128=\"Non Orateur\",IF(AB128=\"Poster\",0.5*0.5,0.5*1),IF(AB128=\"Poster\",0.5*1,1*1)))","v":""},null,{"$f":"IF(AD128=\"\",\"\",(2*AD128))","v":""},null,null,null,""]
[null,null,null,3,null,null,null,null,null,null,null,null,null,null,null,null,null,null,null,null,null,null,null,null,null,null,null,null,null,"",null,"",null,null,null,"",null,null,null,null,null,null,null,null,null,null,null,null,null,null,null,null,null,null,null,null,null,null,null,null,null,20]
[null,null,null,null,null,null,null,null,null,null,null,null,null,null,null,null,null,null,null,null,null,null,null,null,null,null,null,null,null,null,null,null,null,null,null,0]
[null,null,"c) Participation à des écoles thématique de recherche",null,null,null,null,null,null,null,null,null,null,null,null,null,"ج) المشاركة في المدارس الموضوعاتية للبحث",null,null,null,null,null,null,null,null,null,null,null,null,null,null,null,null,null,null,0]
[null,null,null,null,null,null,null,null,null,null,null,null,null,null,null,null,null,null,null,null,null,null,null,null,null,null,null,null,null,null,null,null,null,null,null,0]
[null,null,"Internationale indexée",null,null,null,null,null,null,null,null,null,null,null,null,null,null,"دولي مصنف",null,null,null,null,null,null,null,null,null,null,null,null,null,"24 pts/نقطة",null,null,null,0]
[null,null,null,null,null,null,null,null,null,null,null,null,null,null,null,null,null,null,null,null,null,null,null,null,null,null,null,null,null,null,null,null,null,null,null,0]
[null,null,null,"رقم",null,"إسم المدرسة",null,null,null,"عنوان الدرس المقدّم",null,null,null,null,null,null,null,"فترة",null,null,null,"مؤسسة",null,null,null,null,null,null,null,null,null,"القيمة",null,null,null,0]
[null,null,null,"N°",null,"Nom de l'école",null,null,null,"Titre du cours dispense",null,null,null,null,null,null,null,"Période",null,null,null,"Etablissement",null,null,null,null,null,null,null,null,null,"Valeur",null,null,null,0]
[null,null,null,null,null,null,null,null,null,null,null,null,null,null,null,null,null,null,null,null,null,null,null,null,null,null,null,null,null,null,null,null,null,null,null,0]
[null,null,null,1,null,null,null,null,null,null,null,null,null,null,null,null,null,null,null,null,null,null,null,null,null,null,null,null,null,null,null,{"$f":"IF(AND(F138<>\"\",J138<>\"\"),24,\"\")","v":""},null,null,null,{"$f":"IF(OR(AF138=\"Valeur\",AF138=\"القيمة\"),0,IF(ISERROR(SEARCH(\"/\",AF138)),AF138,0))","v":""}]
[null,null,null,2,null,null,null,null,null,null,null,null,null,null,null,null,null,null,null,null,null,null,null,null,null,null,null,null,null,null,null,{"$f":"IF(AND(F139<>\"\",J139<>\"\"),24,\"\")","v":""},null,null,null,""]
[null,null,null,3,null,null,null,null,null,null,null,null,null,null,null,null,null,null,null,null,null,null,null,null,null,null,null,null,null,null,null,"",null,null,null,"",null,null,null,null,null,null,null,null,null,null,null,null,null,null,null,null,null,null,null,null,null,null,null,null,null,null,21]
[null,null,null,null,null,null,null,null,null,null,null,null,null,null,null,null,null,null,null,null,null,null,null,null,null,null,null,null,null,null,null,null,null,null,null,0]
[null,null,"Internationale",null,null,null,null,null,null,null,null,null,null,null,null,null,null,"دولي",null,null,null,null,null,null,null,null,null,null,null,null,null,"18 pts/نقطة",null,null,null,0]
[null,null,null,null,null,null,null,null,null,null,null,null,null,null,null,null,null,null,null,null,null,null,null,null,null,null,null,null,null,null,null,null,null,null,null,0]
[null,null,null,1,null,null,null,null,null,null,null,null,null,null,null,null,null,null,null,null,null,null,null,null,null,null,null,null,null,null,null,{"$f":"IF(AND(F144<>\"\",J144<>\"\"),18,\"\")","v":""},null,null,null,""]
[null,null,null,2,null,null,null,null,null,null,null,null,null,null,null,null,null,null,null,null,null,null,null,null,null,null,null,null,null,null,null,{"$f":"IF(AND(F145<>\"\",J145<>\"\"),18,\"\")","v":""},null,null,null,""]
[null,null,null,3,null,null,null,null,null,null,null,null,null,null,null,null,null,null,null,null,null,null,null,null,null,null,null,null,null,null,null,"",null,null,null,"",null,null,null,null,null,null,null,null,null,null,null,null,null,null,null,null,null,null,null,null,null,null,null,null,null,null,null,22]
[null,null,null,null,null,null,null,null,null,null,null,null,null,null,null,null,null,null,null,null,null,null,null,null,null,null,null,null,null,null,null,null,null,null,null,0]
[null,null,"Nationale",null,null,null,null,null,null,null,null,null,null,null,null,null,null,"وطني",null,null,null,null,null,null,null,null,null,null,null,null,null,"10 pts/نقطة",null,null,null,0]
[null,null,null,null,null,null,null,null,null,null,null,null,null,null,null,null,null,null,null,null,null,null,null,null,null,null,null,null,null,null,null,null,null,null,null,0]
[null,null,null,1,null,null,null,null,null,null,null,null,null,null,null,null,null,null,null,null,null,null,null,null,null,null,null,null,null,null,null,{"$f":"IF(AND(F150<>\"\",J150<>\"\"),10,\"\")","v":""},null,null,null,""]
[null,null,null,2,null,null,null,null,null,null,null,null,null,null,null,null,null,null,null,null,null,null,null,null,null,null,null,null,null,null,null,{"$f":"IF(AND(F151<>\"\",J151<>\"\"),10,\"\")","v":""},null,null,null,""]
[null,null,null,3,null,null,null,null,null,null,null,null,null,null,null,null,null,null,null,null,null,null,null,null,null,null,null,null,null,null,null,"",null,null,null,"",null,null,null,null,null,null,null,null,null,null,null,null,null,null,null,null,null,null,null,null,null,null,null,null,null,null,null,null,23]
[null,null,null,null,null,null,null,null,null,null,null,null,null,null,null,null,null,null,null,null,null,null,null,null,null,null,null,null,null,null,null,null,null,null,null,0]
[null,null,"d) Projets et programmes de recherche en cours",null,null,null,null,null,null,null,null,null,null,null,null,null,"د) مشاريع وبرامج البحث الحالية",null,null,null,null,null,null,null,null,null,null,null,null,null,null,null,null,null,null,0]
[null,null,null,null,null,null,null,null,null,null,null,null,null,null,null,null,null,null,null,null,null,null,null,null,null,null,null,null,null,null,null,null,null,null,null,0]
[null,null,"Projets de Recherche Internationaux Multilatéraux",null,null,null,null,null,null,null,null,null,null,null,null,"A",null,"مشاريع البحث الدولية المتعددة الأطراف",null,null,null,null,null,null,null,null,null,null,null,null,null,"24 pts/نقطة",null,null,null,0]
[null,null,null,null,null,null,null,null,null,null,null,null,null,null,null,null,null,null,null,null,null,null,null,null,null,null,null,null,null,null,null,null,null,null,null,0]
[null,null,null,"رقم",null,null,null,"تاريخ بداية ونهاية المشروع",null,"عنوان المشروع",null,null,null,null,null,"العنوان الإلكتروني",null,"النوع",null,"اللقب و الاسم",null,null,null,null,null,null,null,"رئيس/عضو",null,"حصة",null,"القيمة",null,null,null,0]
[null,null,null,"N°",null,"ID",null,"Date debut et fin du projet",null,"Intitulé du Projet",null,null,null,null,null,"URL",null,"Type",null,"Nom et Prénom des membres de l'équipe",null,null,null,null,null,null,null,"R/M ",null,"Part des A",null,"Valeur",null,null,null,0]
[null,null,null,null,null,null,null,null,null,null,null,null,null,null,null,null,null,null,null,null,null,null,null,null,null,null,null,null,null,null,null,null,null,null,null,0]
[null,null,null,1,null,null,null,null,null,null,null,null,null,null,null,null,null,null,null,null,null,null,null,null,null,null,null,null,null,{"$f":"IF(AB161=\"\",\"\",IF(AB161=\"Responsable \",1,0.5))","v":""},null,{"$f":"IF(AD161=\"\",\"\",AD161*24)","v":""},null,null,null,""]
[null,null,null,2,null,null,null,null,null,null,null,null,null,null,null,null,null,null,null,null,null,null,null,null,null,null,null,null,null,null,null,null,null,null,null,0]
[null,null,null,3,null,null,null,null,null,null,null,null,null,null,null,null,null,null,null,null,null,null,null,null,null,null,null,null,null,null,null,null,null,null,null,0,null,null,null,null,null,null,null,null,null,null,null,null,null,null,null,null,null,null,null,null,null,null,null,null,null,null,null,null,null,24]
[null,null,null,null,null,null,null,null,null,null,null,null,null,null,null,null,null,null,null,null,null,null,null,null,null,null,null,null,null,null,null,null,null,null,null,0]
[null,null,"Projets de Recherche Internationaux Bilatéraux",null,null,null,null,null,null,null,null,null,null,null,null,"B",null,"مشاريع البحث الدولية الثنائية الأطراف ",null,null,null,null,null,null,null,null,null,null,null,null,null,"20 pts/نقطة",null,null,null,0]
[null,null,null,null,null,null,null,null,null,null,null,null,null,null,null,null,null,null,null,null,null,null,null,null,null,null,null,null,null,null,null,null,null,null,null,0]
[null,null,null,1,null,null,null,null,null,null,null,null,null,null,null,null,null,null,null,null,null,null,null,null,null,null,null,null,null,{"$f":"IF(AB167=\"\",\"\",IF(AB167=\"Responsable \",1,0.5))","v":""},null,{"$f":"IF(AD167=\"\",\"\",AD167*20)","v":""},null,null,null,""]
[null,null,null,2,null,null,null,null,null,null,null,null,null,null,null,null,null,null,null,null,null,null,null,null,null,null,null,null,null,null,null,{"$f":"IF(AD168=\"\",\"\",AD168*20)","v":""},null,null,null,""]
[null,null,null,3,null,null,null,null,null,null,null,null,null,null,null,null,null,null,null,null,null,null,null,null,null,null,null,null,null,null,null,"",null,null,null,"",null,null,null,null,null,null,null,null,null,null,null,null,null,null,null,null,null,null,null,null,null,null,null,null,null,null,null,null,null,null,25]
[null,null,null,null,null,null,null,null,null,null,null,null,null,null,null,null,null,null,null,null,null,null,null,null,null,null,null,null,null,null,null,null,null,null,null,0]
[null,null,"Projets de Recherche Intersectoriels",null,null,null,null,null,null,null,null,null,null,null,null,"C",null,"مشاريع البحث ما بين القطاعات",null,null,null,null,null,null,null,null,null,null,null,null,null,"16 pts/نقطة",null,null,null,0]
[null,null,null,null,null,null,null,null,null,null,null,null,null,null,null,null,null,null,null,null,null,null,null,null,null,null,null,null,null,null,null,null,null,null,null,0]
[null,null,null,1,null,null,null,null,null,null,null,null,null,null,null,null,null,null,null,null,null,null,null,null,null,null,null,null,null,{"$f":"IF(AB173=\"\",\"\",IF(AB173=\"Responsable \",1,0.5))","v":""},null,{"$f":"IF(AD173=\"\",\"\",AD173*16)","v":""},null,null,null,""]
[null,null,null,2,null,null,null,null,null,null,null,null,null,null,null,null,null,null,null,null,null,null,null,null,null,null,null,null,null,null,null,{"$f":"IF(AD174=\"\",\"\",AD174*16)","v":""},null,null,null,""]
[null,null,null,3,null,null,null,null,null,null,null,null,null,null,null,null,null,null,null,null,null,null,null,null,null,null,null,null,null,null,null,"",null,null,null,"",null,null,null,null,null,null,null,null,null,null,null,null,null,null,null,null,null,null,null,null,null,null,null,null,null,null,null,null,null,null,null,26]
[null,null,null,null,null,null,null,null,null,null,null,null,null,null,null,null,null,null,null,null,null,null,null,null,null,null,null,null,null,null,null,null,null,null,null,0]
[null,null,"Projets de Recherche Sectoriels",null,null,null,null,null,null,null,null,null,null,null,null,"D",null,"مشاريع البحث القطاعية",null,null,null,null,null,null,null,null,null,null,null,null,null,"12 pts/نقطة",null,null,null,0]
[null,null,null,null,null,null,null,null,null,null,null,null,null,null,null,null,null,null,null,null,null,null,null,null,null,null,null,null,null,null,null,null,null,null,null,0]
[null,null,null,1,null,null,null,null,null,null,null,null,null,null,null,null,null,null,null,null,null,null,null,null,null,null,null,null,null,{"$f":"IF(AB179=\"\",\"\",IF(AB179=\"Responsable \",1,0.5))","v":""},null,{"$f":"IF(AD179=\"\",\"\",AD179*12)","v":""},null,null,null,""]
[null,null,null,2,null,null,null,null,null,null,null,null,null,null,null,null,null,null,null,null,null,null,null,null,null,null,null,null,null,null,null,{"$f":"IF(AD180=\"\",\"\",AD180*12)","v":""},null,null,null,""]
[null,null,null,3,null,null,null,null,null,null,null,null,null,null,null,null,null,null,null,null,null,null,null,null,null,null,null,null,null,null,null,"",null,null,null,"",null,null,null,null,null,null,null,null,null,null,null,null,null,null,null,null,null,null,null,null,null,null,null,null,null,null,null,null,null,null,null,null,27]
[null,null,null,null,null,null,null,null,null,null,null,null,null,null,null,null,null,null,null,null,null,null,null,null,null,null,null,null,null,null,null,null,null,null,null,0]
[null,null,"Projets de Recherche Spécifique; Rayonnement de l’Etablissement",null,null,null,null,null,null,null,null,null,null,null,null,"E1",null,"مشاريع البحث الخاص؛ إشعاع المؤسسة",null,null,null,null,null,null,null,null,null,null,null,null,null,"8 pts/نقطة",null,null,null,0]
[null,null,null,null,null,null,null,null,null,null,null,null,null,null,null,null,null,null,null,null,null,null,null,null,null,null,null,null,null,null,null,null,null,null,null,0]
[null,null,null,1,null,null,null,null,null,null,null,null,null,null,null,null,null,null,null,null,null,null,null,null,null,null,null,null,null,{"$f":"IF(AB185=\"\",\"\",IF(AB185=\"Responsable \",1,0.5))","v":""},null,{"$f":"IF(AD185=\"\",\"\",AD185*8)","v":""},null,null,null,""]
[null,null,null,2,null,null,null,null,null,null,null,null,null,null,null,null,null,null,null,null,null,null,null,null,null,null,null,null,null,null,null,{"$f":"IF(AD186=\"\",\"\",AD186*8)","v":""},null,null,null,""]
[null,null,null,3,null,null,null,null,null,null,null,null,null,null,null,null,null,null,null,null,null,null,null,null,null,null,null,null,null,null,null,"",null,null,null,"",null,null,null,null,null,null,null,null,null,null,null,null,null,null,null,null,null,null,null,null,null,null,null,null,null,null,null,null,null,null,null,null,null,28]
[null,null,null,null,null,null,null,null,null,null,null,null,null,null,null,null,null,null,null,null,null,null,null,null,null,null,null,null,null,null,null,null,null,null,null,0]
[null,null,"Projets de Recherche Spécifique: Recherche Appliquée",null,null,null,null,null,null,null,null,null,null,null,null,"E2",null,"مشاريع البحث الخاص: بحث تطبيقى",null,null,null,null,null,null,null,null,null,null,null,null,null,"15 pts/نقطة",null,null,null,0]
[null,null,null,null,null,null,null,null,null,null,null,null,null,null,null,null,null,null,null,null,null,null,null,null,null,null,null,null,null,null,null,null,null,null,null,0]
[null,null,null,1,null,null,null,null,null,null,null,null,null,null,null,null,null,null,null,null,null,null,null,null,null,null,null,null,null,{"$f":"IF(AB191=\"\",\"\",IF(AB191=\"Responsable \",1,0.5))","v":""},null,{"$f":"IF(AD191=\"\",\"\",AD191*15)","v":""},null,null,null,""]
[null,null,null,2,null,null,null,null,null,null,null,null,null,null,null,null,null,null,null,null,null,null,null,null,null,null,null,null,null,null,null,{"$f":"IF(AD192=\"\",\"\",AD192*15)","v":""},null,null,null,""]
[null,null,null,3,null,null,null,null,null,null,null,null,null,null,null,null,null,null,null,null,null,null,null,null,null,null,null,null,null,null,null,"",null,null,null,"",null,null,null,null,null,null,null,null,null,null,null,null,null,null,null,null,null,null,null,null,null,null,null,null,null,null,null,null,null,null,null,null,null,null,29]
[null,null,null,null,null,null,null,null,null,null,null,null,null,null,null,null,null,null,null,null,null,null,null,null,null,null,null,null,null,null,null,null,null,null,null,0]
[null,null,"Projets de Recherche Spécifique, Recherche Développement",null,null,null,null,null,null,null,null,null,null,null,null,"E3",null,"مشاريع البحث الخاص: تطوير",null,null,null,null,null,null,null,null,null,null,null,null,null,"15 pts/نقطة",null,null,null,0]
[null,null,null,null,null,null,null,null,null,null,null,null,null,null,null,null,null,null,null,null,null,null,null,null,null,null,null,null,null,null,null,null,null,null,null,0]
[null,null,null,1,null,null,null,null,null,null,null,null,null,null,null,null,null,null,null,null,null,null,null,null,null,null,null,null,null,{"$f":"IF(AB197=\"\",\"\",IF(AB197=\"Responsable \",1,0.5))","v":""},null,{"$f":"IF(AD197=\"\",\"\",AD197*15)","v":""},null,null,null,""]
[null,null,null,2,null,null,null,null,null,null,null,null,null,null,null,null,null,null,null,null,null,null,null,null,null,null,null,null,null,null,null,{"$f":"IF(AD198=\"\",\"\",AD198*15)","v":""},null,null,null,""]
[null,null,null,3,null,null,null,null,null,null,null,null,null,null,null,null,null,null,null,null,null,null,null,null,null,null,null,null,null,null,null,"",null,null,null,"",null,null,null,null,null,null,null,null,null,null,null,null,null,null,null,null,null,null,null,null,null,null,null,null,null,null,null,null,null,null,null,null,null,null,null,30]
[null,null,null,null,null,null,null,null,null,null,null,null,null,null,null,null,null,null,null,null,null,null,null,null,null,null,null,null,null,null,null,null,null,null,null,0]
[null,null,"Projets de Recherche Spécifique; Recherche Formation (projet de thèse, …)",null,null,null,null,null,null,null,null,null,null,null,null,"E4",null,"مشاريع البحث الخاص؛ البحث التكويني (مشروع الأطروحة، ما بعد التدرج، ...)",null,null,null,null,null,null,null,null,null,null,null,null,null,"6 pts/نقطة",null,null,null,0]
[null,null,null,null,null,null,null,null,null,null,null,null,null,null,null,null,null,null,null,null,null,null,null,null,null,null,null,null,null,null,null,null,null,null,null,{"$f":"IF(OR(AF202=\"Valeur\",AF202=\"القيمة\"),0,IF(ISERROR(SEARCH(\"/\",AF202)),AF202,0))","v":0}]
[null,null,null,1,null,null,null,null,null,null,null,null,null,null,null,null,null,null,null,null,null,null,null,null,null,null,null,null,null,{"$f":"IF(AB203=\"\",\"\",IF(AB203=\"Responsable \",1,0.5))","v":""},null,{"$f":"IF(AD203=\"\",\"\",AD203*6)","v":""},null,null,null,""]
[null,null,null,2,null,null,null,null,null,null,null,null,null,null,null,null,null,null,null,null,null,null,null,null,null,null,null,null,null,null,null,{"$f":"IF(AD204=\"\",\"\",AD204*6)","v":""},null,null,null,""]
[null,null,null,3,null,null,null,null,null,null,null,null,null,null,null,null,null,null,null,null,null,null,null,null,null,null,null,null,null,null,null,"",null,null,null,"",null,null,null,null,null,null,null,null,null,null,null,null,null,null,null,null,null,null,null,null,null,null,null,null,null,null,null,null,null,null,null,null,null,null,null,null,31]
[null,null,null,null,null,null,null,null,null,null,null,null,null,null,null,null,null,null,null,null,null,null,null,null,null,null,null,null,null,null,null,null,null,null,null,0]
[null,null,"e) Président ou membre du CS et/ou du CO d’une conférence ou d’un workshop",null,null,null,null,null,null,null,null,null,null,null,null,null,"ﻫ) رئيس أو عضو اللجنة العلمية و/أو لجنة تنظيم محاضرة أو ورشة عمل",null,null,null,null,null,null,null,null,null,null,null,null,null,null,null,null,null,null,0]
[null,null,null,null,null,null,null,null,null,null,null,null,null,null,null,null,null,null,null,null,null,null,null,null,null,null,null,null,null,null,null,null,null,null,null,0]
[null,null,"Exceptionnel: Congrès Mondial",null,null,null,null,null,null,null,null,null,null,null,null,"Exp+",null,"استثنائي: مؤتمر عالمي",null,null,null,null,null,null,null,null,null,null,null,null,null,"40 pts/نقطة",null,null,null,0]
[null,null,null,null,null,null,null,null,null,null,null,null,null,null,null,null,null,null,null,null,null,null,null,null,null,null,null,null,null,null,null,null,null,null,null,0]
[null,null,null,"رقم",null,"اسم المحاضرة",null,null,null,null,null,"اللقب والاسم",null,"السنة",null,"العنوان الإلكتروني",null,null,null,"اللجنة علمية / تنظيمية",null,null,null,null,"مودع/مسجل",null,null,null,null,"حصة",null,"القيمة",null,null,null,0]
[null,null,null,"N°",null,"Nom de la Conférence",null,null,null,null,null,"Nom et prénom",null,"Année",null,"URL",null,null,null,"Comité CS/CO",null,null,null,null,"En tant que P/M ",null,null,null,null,"%",null,"Valeur",null,null,null,0]
[null,null,null,null,null,null,null,null,null,null,null,null,null,null,null,null,null,null,null,null,null,null,null,null,null,null,null,null,null,null,null,null,null,null,null,0]
[null,null,null,1,null,null,null,null,null,null,null,null,null,null,null,null,null,null,null,null,null,null,null,null,null,null,null,null,null,{"$f":"IF(OR(T214=\"\",Y214=\"\"),\"\",IF(T214=\"Comité d'organisation\",IF(Y214=\"Membre\",0.5*0.75,0.75*1),IF(Y214=\"Membre\",0.5*1,1*1)))","v":""},null,{"$f":"IF(AD214=\"\",\"\",AD214*40)","v":""},null,null,null,""]
[null,null,null,2,null,null,null,null,null,null,null,null,null,null,null,null,null,null,null,null,null,null,null,null,null,null,null,null,null,null,null,{"$f":"IF(AD215=\"\",\"\",AD215*40)","v":""},null,null,null,""]
[null,null,null,3,null,null,null,null,null,null,null,null,null,null,null,null,null,null,null,null,null,null,null,null,null,null,null,null,null,null,null,"",null,null,null,"",null,null,null,null,null,null,null,null,null,null,null,null,null,null,null,null,null,null,null,null,null,null,null,null,null,null,null,null,null,null,null,null,null,null,null,null,null,32]
[null,null,null,null,null,null,null,null,null,null,null,null,null,null,null,null,null,null,null,null,null,null,null,null,null,null,null,null,null,null,null,null,null,null,null,0]
[null,null,"Exceptionnel: Congrès continental",null,null,null,null,null,null,null,null,null,null,null,null,"Exp",null,"استثنائي: مؤتمر قاري",null,null,null,null,null,null,null,null,null,null,null,null,null,"20 pts/نقطة",null,null,null,0]
[null,null,null,null,null,null,null,null,null,null,null,null,null,null,null,null,null,null,null,null,null,null,null,null,null,null,null,null,null,null,null,null,null,null,null,0]
[null,null,null,1,null,null,null,null,null,null,null,null,null,null,null,null,null,null,null,null,null,null,null,null,null,null,null,null,null,{"$f":"IF(OR(T220=\"\",Y220=\"\"),\"\",IF(T220=\"Comité d'organisation\",IF(Y220=\"Membre\",0.5*0.75,0.75*1),IF(Y220=\"Membre\",0.5*1,1*1)))","v":""},null,{"$f":"IF(AD220=\"\",\"\",AD220*20)","v":""},null,null,null,""]
[null,null,null,2,null,null,null,null,null,null,null,null,null,null,null,null,null,null,null,null,null,null,null,null,null,null,null,null,null,null,null,{"$f":"IF(AD221=\"\",\"\",AD221*20)","v":""},null,null,null,""]
[null,null,null,3,null,null,null,null,null,null,null,null,null,null,null,null,null,null,null,null,null,null,null,null,null,null,null,null,null,null,null,"",null,null,null,"",null,null,null,null,null,null,null,null,null,null,null,null,null,null,null,null,null,null,null,null,null,null,null,null,null,null,null,null,null,null,null,null,null,null,null,null,null,null,33]
[null,null,null,null,null,null,null,null,null,null,null,null,null,null,null,null,null,null,null,null,null,null,null,null,null,null,null,null,null,null,null,null,null,null,null,0]
[null,null,"Conférence mobile avec actes",null,null,null,null,null,null,null,null,null,null,null,null,"A+, A, B, B+",null,"محاضرة متنقلة مع الأعمال",null,null,null,null,null,null,null,null,null,null,null,null,null,"24 pts/نقطة",null,null,null,0]
[null,null,null,null,null,null,null,null,null,null,null,null,null,null,null,null,null,null,null,null,null,null,null,null,null,null,null,null,null,null,null,null,null,null,null,0]
[null,null,null,1,null,null,null,null,null,null,null,null,null,null,null,null,null,null,null,null,null,null,null,null,null,null,null,null,null,{"$f":"IF(OR(T226=\"\",Y226=\"\"),\"\",IF(T226=\"Comité d'organisation\",IF(Y226=\"Membre\",0.5*0.75,0.75*1),IF(Y226=\"Membre\",0.5*1,1*1)))","v":""},null,{"$f":"IF(AD226=\"\",\"\",AD226*24)","v":""},null,null,null,""]
[null,null,null,2,null,null,null,null,null,null,null,null,null,null,null,null,null,null,null,null,null,null,null,null,null,null,null,null,null,null,null,{"$f":"IF(AD227=\"\",\"\",AD227*24)","v":""},null,null,null,""]
[null,null,null,3,null,null,null,null,null,null,null,null,null,null,null,null,null,null,null,null,null,null,null,null,null,null,null,null,null,null,null,"",null,null,null,"",null,null,null,null,null,null,null,null,null,null,null,null,null,null,null,null,null,null,null,null,null,null,null,null,null,null,null,null,null,null,null,null,null,null,null,null,null,null,null,34]
[null,null,null,null,null,null,null,null,null,null,null,null,null,null,null,null,null,null,null,null,null,null,null,null,null,null,null,null,null,null,null,null,null,null,null,0]
[null,null,"Conférence d’audience internationale avec actes",null,null,null,null,null,null,null,null,null,null,null,null,"C, C+",null,"محاضرة علنية دولية مع الأعمال",null,null,null,null,null,null,null,null,null,null,null,null,null,"15 pts/نقطة",null,null,null,0]
[null,null,null,null,null,null,null,null,null,null,null,null,null,null,null,null,null,null,null,null,null,null,null,null,null,null,null,null,null,null,null,null,null,null,null,0]
[null,null,null,1,null,null,null,null,null,null,null,null,null,null,null,null,null,null,null,null,null,null,null,null,null,null,null,null,null,{"$f":"IF(OR(T232=\"\",Y232=\"\"),\"\",IF(T232=\"Comité d'organisation\",IF(Y232=\"Membre\",0.5*0.75,0.75*1),IF(Y232=\"Membre\",0.5*1,1*1)))","v":""},null,{"$f":"IF(AD232=\"\",\"\",AD232*15)","v":""},null,null,null,""]
[null,null,null,2,null,null,null,null,null,null,null,null,null,null,null,null,null,null,null,null,null,null,null,null,null,null,null,null,null,null,null,{"$f":"IF(AD233=\"\",\"\",AD233*15)","v":""},null,null,null,""]
[null,null,null,3,null,null,null,null,null,null,null,null,null,null,null,null,null,null,null,null,null,null,null,null,null,null,null,null,null,null,null,"",null,null,null,"",null,null,null,null,null,null,null,null,null,null,null,null,null,null,null,null,null,null,null,null,null,null,null,null,null,null,null,null,null,null,null,null,null,null,null,null,null,null,null,null,35]
[null,null,null,null,null,null,null,null,null,null,null,null,null,null,null,null,null,null,null,null,null,null,null,null,null,null,null,null,null,null,null,null,null,null,null,0]
[null,null,"Conférence nationale ou séminaire périodique",null,null,null,null,null,null,null,null,null,null,null,null,"D",null,"مؤتمر وطني أو لقاء منتظم",null,null,null,null,null,null,null,null,null,null,null,null,null,"12 pts/نقطة",null,null,null,0]
[null,null,null,null,null,null,null,null,null,null,null,null,null,null,null,null,null,null,null,null,null,null,null,null,null,null,null,null,null,null,null,null,null,null,null,0]
[null,null,null,1,null,null,null,null,null,null,null,null,null,null,null,null,null,null,null,null,null,null,null,null,null,null,null,null,null,{"$f":"IF(OR(T238=\"\",Y238=\"\"),\"\",IF(T238=\"Comité d'organisation\",IF(Y238=\"Membre\",0.5*0.75,0.75*1),IF(Y238=\"Membre\",0.5*1,1*1)))","v":""},null,{"$f":"IF(AD238=\"\",\"\",AD238*12)","v":""},null,null,null,""]
[null,null,null,2,null,null,null,null,null,null,null,null,null,null,null,null,null,null,null,null,null,null,null,null,null,null,null,null,null,null,null,{"$f":"IF(AD239=\"\",\"\",AD239*12)","v":""},null,null,null,""]
[null,null,null,3,null,null,null,null,null,null,null,null,null,null,null,null,null,null,null,null,null,null,null,null,null,null,null,null,null,null,null,"",null,null,null,"",null,null,null,null,null,null,null,null,null,null,null,null,null,null,null,null,null,null,null,null,null,null,null,null,null,null,null,null,null,null,null,null,null,null,null,null,null,null,null,null,null,36]
[null,null,null,null,null,null,null,null,null,null,null,null,null,null,null,null,null,null,null,null,null,null,null,null,null,null,null,null,null,null,null,null,null,null,null,0]
[null,null,"Conférence de diffusion et vulgarisation",null,null,null,null,null,null,null,null,null,null,null,null,"E",null,"محاضرة للإعلان و التعميم",null,null,null,null,null,null,null,null,null,null,null,null,null,"10 pts/نقطة",null,null,null,0]
[null,null,null,null,null,null,null,null,null,null,null,null,null,null,null,null,null,null,null,null,null,null,null,null,null,null,null,null,null,null,null,null,null,null,null,0]
[null,null,null,1,null,null,null,null,null,null,null,null,null,null,null,null,null,null,null,null,null,null,null,null,null,null,null,null,null,{"$f":"IF(OR(T244=\"\",Y244=\"\"),\"\",IF(T244=\"Comité d'organisation\",IF(Y244=\"Membre\",0.5*0.75,0.75*1),IF(Y244=\"Membre\",0.5*1,1*1)))","v":""},null,{"$f":"IF(AD244=\"\",\"\",AD244*10)","v":""},null,null,null,""]
[null,null,null,2,null,null,null,null,null,null,null,null,null,null,null,null,null,null,null,null,null,null,null,null,null,null,null,null,null,null,null,{"$f":"IF(AD245=\"\",\"\",AD245*10)","v":""},null,null,null,""]
[null,null,null,3,null,null,null,null,null,null,null,null,null,null,null,null,null,null,null,null,null,null,null,null,null,null,null,null,null,null,null,"",null,null,null,"",null,null,null,null,null,null,null,null,null,null,null,null,null,null,null,null,null,null,null,null,null,null,null,null,null,null,null,null,null,null,null,null,null,null,null,null,null,null,null,null,null,null,37]
[null,null,null,null,null,null,null,null,null,null,null,null,null,null,null,null,null,null,null,null,null,null,null,null,null,null,null,null,null,null,null,null,null,null,null,0]
[null,null,"f) Mémoires ou thèses dirigés et soutenus",null,null,null,null,null,null,null,null,null,null,null,null,null,"و) مذكرات أو أطروحات موجهة وتمت مناقشتها",null,null,null,null,null,null,null,null,null,null,null,null,null,null,null,null,null,null,0]
[null,null,null,null,null,null,null,null,null,null,null,null,null,null,null,null,null,null,null,null,null,null,null,null,null,null,null,null,null,null,null,null,null,null,null,0]
[null,null,"Mémoire PFE [master, ingénieur, science médical] (sujet pris dans le laboratoire)",null,null,null,null,null,null,null,null,null,null,null,null,null,null,"مذكرة ماستر أكاديمي (موضوع معالج في المخبر)",null,null,null,null,null,null,null,null,null,null,null,null,null,"3 pts/نقطة",null,null,null,0]
[null,null,null,null,null,null,null,null,null,null,null,null,null,null,null,null,null,null,null,null,null,null,null,null,null,null,null,null,null,null,null,null,null,null,null,0]
[null,null,null,"رقم",null,"لقب واسم الطالب",null,"عنوان بحث الماستر/الماجستير/الدكتوراه",null,null,null,"الكاتب/مشرف الأطروحة",null,"تاريخ المناقشة",null,"مكان المناقشة",null,"عدد إصدار صنف WOS",null,"ر دمك",null,null,null,null,"عدد إصدارصنف B",null,null,"ر دمك",null,null,null,"القيمة",null,null,null,0]
[null,null,null,"N°",null,"Nom & Prénom de(s) l’étudiant(s)",null,"Intitulé du titre de master/magister/doctorat",null,null,null,"Rapporteur/Directeur de thèse",null,"Date de soutenance",null,"Lieu de soutenance",null,"# Pub. Wos",null,"ISSN",null,null,null,null,"# pub. Cat B",null,null,"ISSN",null,null,null,"Valeur",null,null,null,0]
[null,null,null,null,null,null,null,null,null,null,null,null,null,null,null,null,null,null,null,null,null,null,null,null,null,null,null,null,null,null,null,null,null,null,null,0]
[null,null,null,1,null,null,null,null,null,null,null,null,null,null,null,null,null,null,null,null,null,null,null,null,null,null,null,null,null,null,null,{"$f":"IF(OR(F255=\"\",H255=\"\"),\"\",3+3*R255+1*Y255)","v":""},null,null,null,""]
[null,null,null,2,null,null,null,null,null,null,null,null,null,null,null,null,null,null,null,null,null,null,null,null,null,null,null,null,null,null,null,{"$f":"IF(OR(F256=\"\",H256=\"\"),\"\",3+3*R256+1*Y256)","v":""},null,null,null,""]
[null,null,null,3,null,null,null,null,null,null,null,null,null,null,null,null,null,null,null,null,null,null,null,null,null,null,null,null,null,null,null,"",null,null,null,"",null,null,null,null,null,null,null,null,null,null,null,null,null,null,null,null,null,null,null,null,null,null,null,null,null,null,null,null,null,null,null,null,null,null,null,null,null,null,null,null,null,null,null,38]
[null,null,null,null,null,null,null,null,null,null,null,null,null,null,null,null,null,null,null,null,null,null,null,null,null,null,null,null,null,null,null,null,null,null,null,0]
[null,null,"Mémoire de Magister / DEMS",null,null,null,null,null,null,null,null,null,null,null,null,null,null,"مذكرة الماجستير",null,null,null,null,null,null,null,null,null,null,null,null,null,"5 pts/نقطة",null,null,null,0]
[null,null,null,null,null,null,null,null,null,null,null,null,null,null,null,null,null,null,null,null,null,null,null,null,null,null,null,null,null,null,null,null,null,null,null,0]
[null,null,null,1,null,null,null,null,null,null,null,null,null,null,null,null,null,null,null,null,null,null,null,null,null,null,null,null,null,null,null,{"$f":"IF(OR(F261=\"\",H261=\"\"),\"\",5+3*R261+1*Y261)","v":""},null,null,null,""]
[null,null,null,2,null,null,null,null,null,null,null,null,null,null,null,null,null,null,null,null,null,null,null,null,null,null,null,null,null,null,null,{"$f":"IF(OR(F262=\"\",H262=\"\"),\"\",5+3*R262+1*Y262)","v":""},null,null,null,""]
[null,null,null,3,null,null,null,null,null,null,null,null,null,null,null,null,null,null,null,null,null,null,null,null,null,null,null,null,null,null,null,"",null,null,null,"",null,null,null,null,null,null,null,null,null,null,null,null,null,null,null,null,null,null,null,null,null,null,null,null,null,null,null,null,null,null,null,null,null,null,null,null,null,null,null,null,null,null,null,null,39]
[null,null,null,null,null,null,null,null,null,null,null,null,null,null,null,null,null,null,null,null,null,null,null,null,null,null,null,null,null,null,null,null,null,null,null,0]
[null,null,"Thèse de Doctorat / DESM (concerne le candidat membre de l’équipe et le directeur de thèse)",null,null,null,null,null,null,null,null,null,null,null,null,null,null,"أطروحة الدكتوراه (المرشح العضو في الفرقة ومشرف الأطروحة)",null,null,null,null,null,null,null,null,null,null,null,null,null,"15 pts/نقطة",null,null,null,0]
[null,null,null,null,null,null,null,null,null,null,null,null,null,null,null,null,null,null,null,null,null,null,null,null,null,null,null,null,null,null,null,null,null,null,null,{"$f":"IF(OR(AF266=\"Valeur\",AF266=\"القيمة\"),0,IF(ISERROR(SEARCH(\"/\",AF266)),AF266,0))","v":0}]
[null,null,null,1,null,null,null,null,null,null,null,null,null,null,null,null,null,null,null,null,null,null,null,null,null,null,null,null,null,null,null,{"$f":"IF(OR(F267=\"\",H267=\"\"),\"\",15+3*R267+1*Y267)","v":""},null,null,null,""]
[null,null,null,2,null,null,null,null,null,null,null,null,null,null,null,null,null,null,null,null,null,null,null,null,null,null,null,null,null,null,null,{"$f":"IF(OR(F268=\"\",H268=\"\"),\"\",15+3*R268+1*Y268)","v":""},null,null,null,""]
[null,null,null,3,null,null,null,null,null,null,null,null,null,null,null,null,null,null,null,null,null,null,null,null,null,null,null,null,null,null,null,"",null,null,null,"",null,null,null,null,null,null,null,null,null,null,null,null,null,null,null,null,null,null,null,null,null,null,null,null,null,null,null,null,null,null,null,null,null,null,null,null,null,null,null,null,null,null,null,null,null,40]
[null,null,null,null,null,null,null,null,null,null,null,null,null,null,null,null,null,null,null,null,null,null,null,null,null,null,null,null,null,null,null,null,null,null,null,0]
[null,null,"Habilitation (cette rubrique concerne seulement les candidats)",null,null,null,null,null,null,null,null,null,null,null,null,null,null,"التأهيل (تخص هذه الخانة المرشحين فقط)",null,null,null,null,null,null,null,null,null,null,null,null,null,"15 pts/نقطة",null,null,null,0]
[null,null,null,null,null,null,null,null,null,null,null,null,null,null,null,null,null,null,null,null,null,null,null,null,null,null,null,null,null,null,null,null,null,null,null,0]
[null,null,null,1,null,null,null,null,null,null,null,null,null,null,null,null,null,null,null,null,null,null,null,null,null,null,null,null,null,null,null,{"$f":"IF(OR(F273=\"\",H273=\"\"),\"\",15+3*R273+1*Y273)","v":""},null,null,null,""]
[null,null,null,2,null,null,null,null,null,null,null,null,null,null,null,null,null,null,null,null,null,null,null,null,null,null,null,null,null,null,null,{"$f":"IF(OR(F274=\"\",H274=\"\"),\"\",15+3*R274+1*Y274)","v":""},null,null,null,""]
[null,null,null,3,null,null,null,null,null,null,null,null,null,null,null,null,null,null,null,null,null,null,null,null,null,null,null,null,null,null,null,"",null,null,null,"",null,null,null,null,null,null,null,null,null,null,null,null,null,null,null,null,null,null,null,null,null,null,null,null,null,null,null,null,null,null,null,null,null,null,null,null,null,null,null,null,null,null,null,null,null,null,41]
[null,null,null,null,null,null,null,null,null,null,null,null,null,null,null,null,null,null,null,null,null,null,null,null,null,null,null,null,null,null,null,null,null,null,null,0]
[null,null,"g) Distinctions et Prix",null,null,null,null,null,null,null,null,null,null,null,null,null,null,"ز) الشهادات والجوائز",null,null,null,null,null,null,null,null,null,null,null,null,null,null,null,null,null,0]
[null,null,null,null,null,null,null,null,null,null,null,null,null,null,null,null,null,null,null,null,null,null,null,null,null,null,null,null,null,null,null,null,null,null,null,0]
[null,null,"Exceptionnel  à l’international",null,null,null,null,null,null,null,null,null,null,null,null,null,null,"استثنائي على المستوى الدولي",null,null,null,null,null,null,null,null,null,null,null,null,null,"80 pts/نقطة",null,null,null,0]
[null,null,null,null,null,null,null,null,null,null,null,null,null,null,null,null,null,null,null,null,null,null,null,null,null,null,null,null,null,null,null,null,null,null,null,0]
[null,null,null,"رقم",null,"ٳسم الباحث",null,null,null,"ٳسم الجائزة",null,null,null,null,null,null,null,null,null,null,null,null,null,null,null,null,null,"السنة",null,null,null,"القيمة",null,null,null,0]
[null,null,null,"N°",null,"Nom du chercheur",null,null,null,"Nom du Prix",null,null,null,null,null,null,null,null,null,null,null,null,null,null,null,null,null,"Année",null,null,null,"Valeur",null,null,null,0]
[null,null,null,null,null,null,null,null,null,null,null,null,null,null,null,null,null,null,null,null,null,null,null,null,null,null,null,null,null,null,null,null,null,null,null,0]
[null,null,null,1,null,null,null,null,null,null,null,null,null,null,null,null,null,null,null,null,null,null,null,null,null,null,null,null,null,null,null,{"$f":"IF(OR(F284=\"\",J284=\"\"),\"\",80)","v":""},null,null,null,""]
[null,null,null,2,null,null,null,null,null,null,null,null,null,null,null,null,null,null,null,null,null,null,null,null,null,null,null,null,null,null,null,{"$f":"IF(OR(F285=\"\",J285=\"\"),\"\",80)","v":""},null,null,null,""]
[null,null,null,3,null,null,null,null,null,null,null,null,null,null,null,null,null,null,null,null,null,null,null,null,null,null,null,null,null,null,null,"",null,null,null,"",null,null,null,null,null,null,null,null,null,null,null,null,null,null,null,null,null,null,null,null,null,null,null,null,null,null,null,null,null,null,null,null,null,null,null,null,null,null,null,null,null,null,null,null,null,null,null,42]
[null,null,null,null,null,null,null,null,null,null,null,null,null,null,null,null,null,null,null,null,null,null,null,null,null,null,null,null,null,null,null,null,null,null,null,0]
[null,null,"International",null,null,null,null,null,null,null,null,null,null,null,null,null,null,"دولي",null,null,null,null,null,null,null,null,null,null,null,null,null,"50 pts/نقطة",null,null,null,0]
[null,null,null,null,null,null,null,null,null,null,null,null,null,null,null,null,null,null,null,null,null,null,null,null,null,null,null,null,null,null,null,null,null,null,null,0]
[null,null,null,1,null,null,null,null,null,null,null,null,null,null,null,null,null,null,null,null,null,null,null,null,null,null,null,null,null,null,null,{"$f":"IF(OR(F290=\"\",J290=\"\"),\"\",50)","v":""},null,null,null,""]
[null,null,null,2,null,null,null,null,null,null,null,null,null,null,null,null,null,null,null,null,null,null,null,null,null,null,null,null,null,null,null,{"$f":"IF(OR(F291=\"\",J291=\"\"),\"\",50)","v":""},null,null,null,""]
[null,null,null,3,null,null,null,null,null,null,null,null,null,null,null,null,null,null,null,null,null,null,null,null,null,null,null,null,null,null,null,"",null,null,null,"",null,null,null,null,null,null,null,null,null,null,null,null,null,null,null,null,null,null,null,null,null,null,null,null,null,null,null,null,null,null,null,null,null,null,null,null,null,null,null,null,null,null,null,null,null,null,null,null,43]
[null,null,null,null,null,null,null,null,null,null,null,null,null,null,null,null,null,null,null,null,null,null,null,null,null,null,null,null,null,null,null,null,null,null,null,0]
[null,null,"National",null,null,null,null,null,null,null,null,null,null,null,null,null,null,"وطني",null,null,null,null,null,null,null,null,null,null,null,null,null,"30 pts/نقطة",null,null,null,0]
[null,null,null,null,null,null,null,null,null,null,null,null,null,null,null,null,null,null,null,null,null,null,null,null,null,null,null,null,null,null,null,null,null,null,null,0]
[null,null,null,1,null,null,null,null,null,null,null,null,null,null,null,null,null,null,null,null,null,null,null,null,null,null,null,null,null,null,null,{"$f":"IF(OR(F296=\"\",J296=\"\"),\"\",30)","v":""},null,null,null,""]
[null,null,null,2,null,null,null,null,null,null,null,null,null,null,null,null,null,null,null,null,null,null,null,null,null,null,null,null,null,null,null,{"$f":"IF(OR(F297=\"\",J297=\"\"),\"\",30)","v":""},null,null,null,""]
[null,null,null,3,null,null,null,null,null,null,null,null,null,null,null,null,null,null,null,null,null,null,null,null,null,null,null,null,null,null,null,"",null,null,null,"",null,null,null,null,null,null,null,null,null,null,null,null,null,null,null,null,null,null,null,null,null,null,null,null,null,null,null,null,null,null,null,null,null,null,null,null,null,null,null,null,null,null,null,null,null,null,null,null,null,44]
[null,null,null,null,null,null,null,null,null,null,null,null,null,null,null,null,null,null,null,null,null,null,null,null,null,null,null,null,null,null,null,null,null,null,null,0]
[null,null,"h) Membre de jury de DESM, doctorat ou d’habilitation",null,null,null,null,null,null,null,null,null,null,null,null,null,"ح) عضو لجنة التحكيم خارج المؤسسة ",null,null,null,null,null,null,null,null,null,null,null,null,null,null,null,null,null,null,0]
[null,null,null,null,null,null,null,null,null,null,null,null,null,null,null,null,null,null,null,null,null,null,null,null,null,null,null,null,null,null,null,null,null,null,null,0]
[null,null,"Dans l’établissement",null,null,null,null,null,null,null,null,null,null,null,null,null,null,"داخل المؤسسة",null,null,null,null,null,null,null,null,null,null,null,null,null,"3 pts/نقطة",null,null,null,0]
[null,null,null,null,null,null,null,null,null,null,null,null,null,null,null,null,null,null,null,null,null,null,null,null,null,null,null,null,null,null,null,null,null,null,null,0]
[null,null,null,"رقم",null,"نوع النشاط",null,"مؤسسة",null,null,null,"عضو في الفرقة",null,"مترشح (اسم ، لقب)",null,null,null,"عنوان",null,null,null,null,null,null,"100 /60 /40 ",null,null,null,null,"حصة",null,"القيمة",null,null,null,0]
[null,null,null,"N°",null,"Type",null,"Etablissement",null,null,null,"Membre de l'équipe",null,"Candidat (Nom;Prénom)",null,null,null,"Titre",null,null,null,null,null,null,"P/M/I",null,null,null,null,"%",null,"Valeur",null,null,null,0]
[null,null,null,null,null,null,null,null,null,null,null,null,null,null,null,null,null,null,null,null,null,null,null,null,null,null,null,null,null,null,null,null,null,null,null,0]
[null,null,null,1,null,null,null,null,null,null,null,null,null,null,null,null,null,null,null,null,null,null,null,null,null,null,null,null,null,{"$f":"IF(Y307=\"\",\"\",IF(Y307=\"Président\",\"100%\",IF(Y307=\"Rapporteur\",\"60%\",\"40%\")))","v":""},null,{"$f":"IF(AD307=\"\",\"\",3*AD307)","v":""},null,null,null,""]
[null,null,null,2,null,null,null,null,null,null,null,null,null,null,null,null,null,null,null,null,null,null,null,null,null,null,null,null,null,{"$f":"IF(Y308=\"\",\"\",IF(Y308=\"Président\",\"100%\",IF(Y308=\"Rapporteur\",\"60%\",\"40%\")))","v":""},null,{"$f":"IF(AD308=\"\",\"\",3*AD308)","v":""},null,null,null,""]
[null,null,null,3,null,null,null,null,null,null,null,null,null,null,null,null,null,null,null,null,null,null,null,null,null,null,null,null,null,"",null,"",null,null,null,"",null,null,null,null,null,null,null,null,null,null,null,null,null,null,null,null,null,null,null,null,null,null,null,null,null,null,null,null,null,null,null,null,null,null,null,null,null,null,null,null,null,null,null,null,null,null,null,null,null,null,45]
[null,null,null,null,null,null,null,null,null,null,null,null,null,null,null,null,null,null,null,null,null,null,null,null,null,null,null,null,null,null,null,null,null,null,null,0]
[null,null,"National hors établissement",null,null,null,null,null,null,null,null,null,null,null,null,null,null,"المؤسسات الوطنية",null,null,null,null,null,null,null,null,null,null,null,null,null,"20 pts/نقطة",null,null,null,0]
[null,null,null,null,null,null,null,null,null,null,null,null,null,null,null,null,null,null,null,null,null,null,null,null,null,null,null,null,null,null,null,null,null,null,null,0]
[null,null,null,1,null,null,null,null,null,null,null,null,null,null,null,null,null,null,null,null,null,null,null,null,null,null,null,null,null,{"$f":"IF(Y313=\"\",\"\",IF(Y313=\"Président\",\"100%\",IF(Y313=\"Rapporteur\",\"60%\",\"40%\")))","v":""},null,{"$f":"IF(AD313=\"\",\"\",20*AD313)","v":""},null,null,null,""]
[null,null,null,2,null,null,null,null,null,null,null,null,null,null,null,null,null,null,null,null,null,null,null,null,null,null,null,null,null,{"$f":"IF(Y314=\"\",\"\",IF(Y314=\"Président\",\"100%\",IF(Y314=\"Rapporteur\",\"60%\",\"40%\")))","v":""},null,{"$f":"IF(AD314=\"\",\"\",20*AD314)","v":""},null,null,null,""]
[null,null,null,3,null,null,null,null,null,null,null,null,null,null,null,null,null,null,null,null,null,null,null,null,null,null,null,null,null,"",null,"",null,null,null,"",null,null,null,null,null,null,null,null,null,null,null,null,null,null,null,null,null,null,null,null,null,null,null,null,null,null,null,null,null,null,null,null,null,null,null,null,null,null,null,null,null,null,null,null,null,null,null,null,null,null,null,46]
[null,null,null,null,null,null,null,null,null,null,null,null,null,null,null,null,null,null,null,null,null,null,null,null,null,null,null,null,null,null,null,null,null,null,null,0]
[null,null,"Etranger au pays de l’établissement",null,null,null,null,null,null,null,null,null,null,null,null,null,null,"المؤسسات  الأجنبية",null,null,null,null,null,null,null,null,null,null,null,null,null,"50 pts/نقطة",null,null,null,0]
[null,null,null,null,null,null,null,null,null,null,null,null,null,null,null,null,null,null,null,null,null,null,null,null,null,null,null,null,null,null,null,null,null,null,null,0]
[null,null,null,1,null,null,null,null,null,null,null,null,null,null,null,null,null,null,null,null,null,null,null,null,null,null,null,null,null,{"$f":"IF(Y319=\"\",\"\",IF(Y319=\"Président\",\"100%\",IF(Y319=\"Rapporteur\",\"60%\",\"40%\")))","v":""},null,{"$f":"IF(AD319=\"\",\"\",50*AD319)","v":""},null,null,null,""]
[null,null,null,2,null,null,null,null,null,null,null,null,null,null,null,null,null,null,null,null,null,null,null,null,null,null,null,null,null,{"$f":"IF(Y320=\"\",\"\",IF(Y320=\"Président\",\"100%\",IF(Y320=\"Rapporteur\",\"60%\",\"40%\")))","v":""},null,{"$f":"IF(AD320=\"\",\"\",50*AD320)","v":""},null,null,null,""]
[null,null,null,3,null,null,null,null,null,null,null,null,null,null,null,null,null,null,null,null,null,null,null,null,null,null,null,null,null,"",null,"",null,null,null,"",null,null,null,null,null,null,null,null,null,null,null,null,null,null,null,null,null,null,null,null,null,null,null,null,null,null,null,null,null,null,null,null,null,null,null,null,null,null,null,null,null,null,null,null,null,null,null,null,null,null,null,null,47]
[]
[]
[null,null,"Tableau récapitulatif 2",null,null,null,null,null,null,null,null,null,null,null,null,null,null,null,null,null,null,null,null,null,null,null,null,"جدول مختصر 2"]
[]
[]
[null,null,null,"Rayonnement, visibilité et attractivité académique",null,null,null,null,null,null,null,null,null,"Valeur/القيمة",null,"الإشعاع، المقروئية والاستقطاب الأكاديمي"]
[null,null,null,"  a) Plénière ou tutorial à une conférence scientifique ou cours dans un workshop",null,null,null,null,null,null,null,null,null,{"$f":"SUM(AJ8:AJ58)","v":0},null,"أ) حصة علنية أو أعمال موجهة في محاضرة علمية أو درس في ورشة عمل"]
[null,null,null,"  b) Communication à une conférence scientifique",null,null,null,null,null,null,null,null,null,{"$f":"SUM(AJ67:AJ129)","v":0},null,"ب) مداخلة ضمن محاضرة علمية"]
[null,null,null,"  c) Participation à des écoles thématique de recherche",null,null,null,null,null,null,null,null,null,{"$f":"SUM(AJ138:AJ152)","v":0},null,"ج) المشاركة في المدارس الموضوعاتية للبحث"]
[null,null,null,"  d) Projets et programmes de recherche en cours",null,null,null,null,null,null,null,null,null,{"$f":"SUM(AJ161:AJ205)","v":0},null,"د) مشاريع وبرامج البحث الحالية"]
[null,null,null,"  e) Président ou membre du CS et/ou du CO d’une conférence ou d’un workshop",null,null,null,null,null,null,null,null,null,{"$f":"SUM(AJ214:AJ246)","v":0},null,"ﻫ) رئيس أو عضو اللجنة العلمية و/أو لجنة تنظيم محاضرة أو ورشة عمل"]
[null,null,null,"  f) Mémoires ou thèses dirigés et soutenus",null,null,null,null,null,null,null,null,null,{"$f":"SUM(AJ255:AJ275)","v":0},null,"و) مذكرات أو أطروحات موجهة وتمت مناقشتها"]
[null,null,null,"  g) Distinctions et Prix",null,null,null,null,null,null,null,null,null,{"$f":"SUM(AJ284:AJ298)","v":0},null,"ز) الشهادات والجوائز"]
[null,null,null,"  h) Membre de jury de DESM, doctorat ou d’habilitation hors établissement",null,null,null,null,null,null,null,null,null,{"$f":"SUM(AJ307:AJ321)","v":0},null,"ح) عضو لجنة التحكيم خارج المؤسسة "]
[null,null,null,"Total rayonnement, visibilité et attractivité académique",null,null,null,null,null,null,null,null,null,{"$f":"SUM(N328:O335)","v":0},null,"مجموع الإشعاع، المقروئية والاستقطاب الأكاديمي"]

{"sheet":"Eq.Adéq","index":4,"n_rows":61,"n_cols":49,"rows_kept":61,"cut":false,"hidden":false,"merged":[[2,25,2,26],[4,5,4,6],[4,8,4,10],[0,1,0,10],[0,11,0,27],[1,2,1,10],[1,11,1,26],[2,2,2,10],[4,12,4,14],[5,5,5,6],[5,8,5,10],[7,8,7,10],[8,8,8,10],[9,8,9,10],[7,5,7,6],[8,5,8,6],[9,5,9,6],[2,12,2,24],[5,12,5,14],[4,18,4,21],[5,18,5,21],[7,18,7,21],[7,12,7,14],[8,12,8,14],[9,12,9,14],[8,18,8,21],[9,18,9,21],[17,2,17,9],[17,12,17,24],[17,25,17,26],[11,25,11,26],[15,5,15,6],[15,8,15,10],[19,5,19,6],[19,8,19,10],[20,5,20,6],[20,8,20,10],[11,2,11,9],[11,12,11,24],[13,5,13,6],[13,8,13,10],[14,5,14,6],[14,8,14,10],[19,12,19,14],[20,12,20,14],[20,18,20,21],[13,12,13,14],[13,18,13,21],[14,12,14,14],[14,18,14,21],[15,12,15,14],[40,25,40,26],[46,2,46,9],[46,12,46,24],[46,25,46,26],[42,5,42,6],[42,8,42,10],[42,18,42,21],[43,5,43,6],[43,8,43,10],[43,18,43,21],[44,5,44,6],[44,8,44,10],[40,2,40,9],[40,12,40,24],[42,12,42,14],[43,12,43,14],[44,12,44,14],[44,18,44,21],[31,25,31,26],[33,5,33,6],[33,8,33,10],[33,18,33,21],[38,5,38,6],[36,8,36,10],[37,8,37,10],[38,8,38,10],[36,18,36,21],[37,18,37,21],[38,18,38,21],[33,12,33,14],[34,12,34,14],[36,12,36,14],[37,12,37,14],[38,12,38,14],[34,18,34,21],[36,5,36,6],[37,5,37,6],[31,2,31,9],[31,12,31,24],[60,3,60,9],[57,11,57,25],[58,11,58,25],[59,11,59,25],[60,11,60,25],[57,3,57,9],[54,2,55,5],[54,21,55,26],[50,5,50,6],[50,8,50,10],[50,18,50,21],[58,3,58,9],[59,3,59,9],[50,12,50,14],[21,5,21,6],[21,8,21,10],[21,12,21,14],[21,18,21,21],[25,12,25,14],[25,18,25,21],[26,12,26,14],[23,2,23,9],[23,12,23,24],[15,18,15,21],[48,18,48,21],[19,18,19,21],[48,5,48,6],[48,8,48,10],[49,5,49,6],[49,8,49,10],[49,18,49,21],[34,5,34,6],[34,8,34,10],[48,12,48,14],[49,12,49,14],[29,11,29,26],[29,2,29,10],[23,25,23,26],[26,5,26,6],[26,8,26,10],[27,5,27,6],[27,8,27,10],[25,5,25,6],[25,8,25,10],[26,18,26,21],[27,12,27,14],[27,18,27,21]]}
[{"$f":"CONCATENATE(\"Equipe\",\" \",'2.Pré. Eq'!AN5)","v":"Equipe "}," 4. Adéquation et interactions avec l’environnement économique, culturel et social",null,null,null,null,null,null,null,null,null,"4.التلاؤم والتفاعل مع المحيط الاقتصادي والثقافي والاجتماعي",null,null,null,null,null,null,null,null,null,null,null,null,null,null,null,null,{"$f":"CONCATENATE(\"فرقة\",\" \",'2.Pré. Eq'!AN5)","v":"فرقة "}]
[null,null,"a) Organisation de périples scientifiques, de salons ou autres  activités pour la diffusion de la science et de la technologie et/ou la diffusion de la culture scientifique \n",null,null,null,null,null,null,null,null,"أ) تنظيم قوافل علمية ومعارض ونشاطات أخرى بهدف نشر العلوم والتكنولوجيا و/أو نشر الثقافة العلمية"]
[null,null,"Exceptionnel : organisation de périples scientifiques avec des personnalités de premier rang mondial",null,null,null,null,null,null,null,null,null,"استثنائي : تنظيم قوافل علمية مع شخصيات عالمية بارزة",null,null,null,null,null,null,null,null,null,null,null,null,"100 pts/نقطة"]
[]
[null,null,null,"رقم",null,"اسم الحدث أو الباحث",null,null,"أهمية الحدث",null,null,null,"اللقب والاسم",null,null,null,"السنة",null,"الصفة",null,null,null,null,"حصة",null,"القيمة"]
[null,null,null,"N°",null,"Nom de l’événement ou du Scientifique",null,null,"Dimension de l’événement",null,null,null,"Nom et prénom",null,null,null,"Année",null,"En tant que R/M",null,null,null,null,"%",null,"Valeur"]
[]
[null,null,null,1,null,null,null,null,null,null,null,null,null,null,null,null,null,null,null,null,null,null,null,{"$f":"IF(S8=\"\",\"\",IF(S8=\"Membre\",\"50%\",\"100%\"))","v":""},null,{"$f":"IF(X8=\"\",\"\",X8*100)","v":""},null,null,null,null,{"$f":"IF(OR(Z8=\"Valeur\",Z8=\"القيمة\"),0,IF(ISERROR(SEARCH(\"/\",Z8)),Z8,0))","v":""}]
[null,null,null,2,null,null,null,null,null,null,null,null,null,null,null,null,null,null,null,null,null,null,null,{"$f":"IF(S9=\"\",\"\",IF(S9=\"Membre\",\"50%\",\"100%\"))","v":""},null,{"$f":"IF(X9=\"\",\"\",X9*100)","v":""},null,null,null,null,{"$f":"IF(OR(Z9=\"Valeur\",Z9=\"القيمة\"),0,IF(ISERROR(SEARCH(\"/\",Z9)),Z9,0))","v":""}]
[null,null,null,3,null,null,null,null,null,null,null,null,null,null,null,null,null,null,null,null,null,null,null,"",null,"",null,null,null,null,"",null,null,null,null,null,null,null,null,null,null,null,1]
[null,null,null,null,null,null,null,null,null,null,null,null,null,null,null,null,null,null,null,null,null,null,null,null,null,null,null,null,null,null,0]
[null,null,"Organisation de cycles de conférences grand public, de  salon d’innovation ou de vulgarisation",null,null,null,null,null,null,null,"A",null,"تنظيم سلسلة محاضرات للجمهور العريض، معارض الابتكار أو التعميم",null,null,null,null,null,null,null,null,null,null,null,null,"50 pts/نقطة",null,null,null,null,0]
[null,null,null,null,null,null,null,null,null,null,null,null,null,null,null,null,null,null,null,null,null,null,null,null,null,null,null,null,null,null,0]
[null,null,null,1,null,null,null,null,null,null,null,null,null,null,null,null,null,null,null,null,null,null,null,{"$f":"IF(S14=\"\",\"\",IF(S14=\"Membre\",\"50%\",\"100%\"))","v":""},null,{"$f":"IF(X14=\"\",\"\",X14*50)","v":""},null,null,null,null,""]
[null,null,null,2,null,null,null,null,null,null,null,null,null,null,null,null,null,null,null,null,null,null,null,{"$f":"IF(S15=\"\",\"\",IF(S15=\"Membre\",\"50%\",\"100%\"))","v":""},null,{"$f":"IF(X15=\"\",\"\",X15*50)","v":""},null,null,null,null,""]
[null,null,null,3,null,null,null,null,null,null,null,null,null,null,null,null,null,null,null,null,null,null,null,"",null,"",null,null,null,null,"",null,null,null,null,null,null,null,null,null,null,null,null,2]
[null,null,null,null,null,null,null,null,null,null,null,null,null,null,null,null,null,null,null,null,null,null,null,null,null,null,null,null,null,null,0]
[null,null,"Participation ou organisation d’émission, film ou reportage",null,null,null,null,null,null,null,"B",null,"المشاركة في أو إعداد حصة، فيلم أو تحقيق",null,null,null,null,null,null,null,null,null,null,null,null,"30 pts/نقطة",null,null,null,null,0]
[null,null,null,null,null,null,null,null,null,null,null,null,null,null,null,null,null,null,null,null,null,null,null,null,null,null,null,null,null,null,0]
[null,null,null,1,null,null,null,null,null,null,null,null,null,null,null,null,null,null,null,null,null,null,null,{"$f":"IF(S20=\"\",\"\",IF(S20=\"Membre\",\"50%\",\"100%\"))","v":""},null,{"$f":"IF(X20=\"\",\"\",X20*30)","v":""},null,null,null,null,""]
[null,null,null,2,null,null,null,null,null,null,null,null,null,null,null,null,null,null,null,null,null,null,null,{"$f":"IF(S21=\"\",\"\",IF(S21=\"Membre\",\"50%\",\"100%\"))","v":""},null,{"$f":"IF(X21=\"\",\"\",X21*30)","v":""},null,null,null,null,""]
[null,null,null,3,null,null,null,null,null,null,null,null,null,null,null,null,null,null,null,null,null,null,null,"",null,"",null,null,null,null,"",null,null,null,null,null,null,null,null,null,null,null,null,null,3]
[null,null,null,null,null,null,null,null,null,null,null,null,null,null,null,null,null,null,null,null,null,null,null,null,null,null,null,null,null,null,0]
[null,null,"Organisation et/ou participation à des activités de vulgarisation",null,null,null,null,null,null,null,"C",null,"تنظيم و/أو المشاركة في أنشطة التعميم",null,null,null,null,null,null,null,null,null,null,null,null,"30 pts/نقطة",null,null,null,null,0]
[null,null,null,null,null,null,null,null,null,null,null,null,null,null,null,null,null,null,null,null,null,null,null,null,null,null,null,null,null,null,0]
[null,null,null,1,null,null,null,null,null,null,null,null,null,null,null,null,null,null,null,null,null,null,null,{"$f":"IF(S26=\"\",\"\",IF(S26=\"Membre\",\"50%\",\"100%\"))","v":""},null,{"$f":"IF(X26=\"\",\"\",X26*30)","v":""},null,null,null,null,""]
[null,null,null,2,null,null,null,null,null,null,null,null,null,null,null,null,null,null,null,null,null,null,null,{"$f":"IF(S27=\"\",\"\",IF(S27=\"Membre\",\"50%\",\"100%\"))","v":""},null,{"$f":"IF(X27=\"\",\"\",X27*30)","v":""},null,null,null,null,""]
[null,null,null,3,null,null,null,null,null,null,null,null,null,null,null,null,null,null,null,null,null,null,null,"",null,"",null,null,null,null,"",null,null,null,null,null,null,null,null,null,null,null,null,null,null,4]
[null,null,null,null,null,null,null,null,null,null,null,null,null,null,null,null,null,null,null,null,null,null,null,null,null,null,null,null,null,null,0]
[null,null,"b) Partenariat avec le secteur socio-économique",null,null,null,null,null,null,null,null,"ب) الشراكة مع القطاع الاجتماعي والاقتصادي",null,null,null,null,null,null,null,null,null,null,null,null,null,null,null,null,null,null,0]
[null,null,null,null,null,null,null,null,null,null,null,null,null,null,null,null,null,null,null,null,null,null,null,null,null,null,null,null,null,null,0]
[null,null,"Convention (avenant)",null,null,null,null,null,null,null,"A",null,"الاتفاقية (الملحق)",null,null,null,null,null,null,null,null,null,null,null,null,"30 pts/نقطة",null,null,null,null,0]
[null,null,null,null,null,null,null,null,null,null,null,null,null,null,null,null,null,null,null,null,null,null,null,null,null,null,null,null,null,null,0]
[null,null,null,"رقم",null,"تحديد الشريك ",null,null,"نوع النشاط",null,null,null,"لقب واسم الباحث",null,null,null,"السنة",null,"الصفة",null,null,null,null,"حصة",null,"القيمة",null,null,null,null,0]
[null,null,null,"N°",null,"Identification du partenaire",null,null,"Type d’action",null,null,null,"Nom et prénom du chercheur",null,null,null,"Année",null,"En tant que R/M",null,null,null,null,"%",null,"Valeur",null,null,null,null,0]
[null,null,null,null,null,null,null,null,null,null,null,null,null,null,null,null,null,null,null,null,null,null,null,null,null,null,null,null,null,null,0]
[null,null,null,1,null,null,null,null,null,null,null,null,null,null,null,null,null,null,null,null,null,null,null,{"$f":"IF(S37=\"\",\"\",IF(S37=\"Membre\",\"50%\",\"100%\"))","v":""},null,{"$f":"IF(X37=\"\",\"\",X37*30)","v":""},null,null,null,null,""]
[null,null,null,2,null,null,null,null,null,null,null,null,null,null,null,null,null,null,null,null,null,null,null,{"$f":"IF(S38=\"\",\"\",IF(S38=\"Membre\",\"50%\",\"100%\"))","v":""},null,{"$f":"IF(X38=\"\",\"\",X38*30)","v":""},null,null,null,null,""]
[null,null,null,3,null,null,null,null,null,null,null,null,null,null,null,null,null,null,null,null,null,null,null,"",null,"",null,null,null,null,"",null,null,null,null,null,null,null,null,null,null,null,null,null,null,null,5]
[null,null,null,null,null,null,null,null,null,null,null,null,null,null,null,null,null,null,null,null,null,null,null,null,null,null,null,null,null,null,0,null,null,null,null,null,null,null,null,null,null,null,null,null,null,null,null,6]
[null,null,"Rapport d’expertise (ou enquête), réalisation de guide ou de fiche technique",null,null,null,null,null,null,null,"B",null," تقرير الخبير (أو التحقيق) ، إعداد دليل أو بطاقة فنية",null,null,null,null,null,null,null,null,null,null,null,null,"30 pts/نقطة",null,null,null,null,0]
[null,null,null,null,null,null,null,null,null,null,null,null,null,null,null,null,null,null,null,null,null,null,null,null,null,null,null,null,null,null,0]
[null,null,null,1,null,null,null,null,null,null,null,null,null,null,null,null,null,null,null,null,null,null,null,{"$f":"IF(S43=\"\",\"\",IF(S43=\"Membre\",\"50%\",\"100%\"))","v":""},null,{"$f":"IF(X43=\"\",\"\",X43*30)","v":""},null,null,null,null,""]
[null,null,null,2,null,null,null,null,null,null,null,null,null,null,null,null,null,null,null,null,null,null,null,{"$f":"IF(S44=\"\",\"\",IF(S44=\"Membre\",\"50%\",\"100%\"))","v":""},null,{"$f":"IF(X44=\"\",\"\",X44*30)","v":""},null,null,null,null,""]
[null,null,null,3,null,null,null,null,null,null,null,null,null,null,null,null,null,null,null,null,null,null,null,"",null,"",null,null,null,null,"",null,null,null,null,null,null,null,null,null,null,null,null,null,null,null,null,6]
[null,null,null,null,null,null,null,null,null,null,null,null,null,null,null,null,null,null,null,null,null,null,null,null,null,null,null,null,null,null,0,null,null,null,null,null,null,null,null,null,null,null,null,null,null,null,null,null,7]
[null,null,"Exploitation du brevet",null,null,null,null,null,null,null,null,null,"استغلال براءة الاختراع ",null,null,null,null,null,null,null,null,null,null,null,null,"30 pts/نقطة",null,null,null,null,0]
[null,null,null,null,null,null,null,null,null,null,null,null,null,null,null,null,null,null,null,null,null,null,null,null,null,null,null,null,null,null,0]
[null,null,null,1,null,null,null,null,null,null,null,null,null,null,null,null,null,null,null,null,null,null,null,{"$f":"IF(S49=\"\",\"\",IF(S49=\"Membre\",\"50%\",\"100%\"))","v":""},null,{"$f":"IF(X49=\"\",\"\",X49*30)","v":""},null,null,null,null,""]
[null,null,null,2,null,null,null,null,null,null,null,null,null,null,null,null,null,null,null,null,null,null,null,{"$f":"IF(S50=\"\",\"\",IF(S50=\"Membre\",\"50%\",\"100%\"))","v":""},null,{"$f":"IF(X50=\"\",\"\",X50*30)","v":""},null,null,null,null,""]
[null,null,null,3,null,null,null,null,null,null,null,null,null,null,null,null,null,null,null,null,null,null,null,"",null,"",null,null,null,null,"",null,null,null,null,null,null,null,null,null,null,null,null,null,null,null,null,null,7]
[]
[]
[]
[null,null,"Tableau récapitulatif  3",null,null,null,null,null,null,null,null,null,null,null,null,null,null,null,null,null,null,"جدول مختصر 3"]
[]
[]
[null,null,null,"Adéquation et interactions avec l’environnement économique, culturel et social",null,null,null,null,null,null,"Valeur/القيمة","للتلاؤم والتفاعل مع المحيط الاقتصادي والثقافي والاجتماعي"]
[null,null,null,"a) Organisation de périples scientifiques, de salons ou autres activités pour la diffusion de la science et de la technologie et/ou de la diffusion de la culture scientifique                                  ",null,null,null,null,null,null,{"$f":"SUM(AE8:AE28)","v":0}," أ) تنظيم قوافل علمية ومعارض ونشاطات أخرى بهدف نشر العلوم والتكنولوجيا و/أو نشر الثقافة العلمية",null,null,null,{"$f":"SUM(#REF!,#REF!,#REF!,#REF!)","v":{"$error":"#REF!"}}]
[null,null,null,"b) Partenariat avec le secteur socio-économique",null,null,null,null,null,null,{"$f":"SUM(AE37:AE51)","v":0},"ب) الشراكة مع القطاع الاجتماعي والاقتصادي",null,null,null,{"$f":"SUM(#REF!,#REF!,#REF!)","v":{"$error":"#REF!"}}]
[null,null,null,"Total de l’adéquation et interactions avec l’environnement économique, culturel et social",null,null,null,null,null,null,{"$f":"SUM(K59:K60)","v":0},"مجموع تلاؤم وتفاعل مع المحيط الاقتصادي والثقافي والاجتماعي "]

{"sheet":"Eq.Visibilité","index":5,"n_rows":24,"n_cols":25,"rows_kept":24,"cut":false,"hidden":false,"merged":[[22,13,22,20],[19,11,19,12],[22,3,22,10],[19,3,19,10],[20,3,20,10],[21,11,21,12],[22,11,22,12],[20,11,20,12],[17,3,18,20],[9,3,9,9],[4,3,4,9],[10,15,10,19],[21,3,21,10],[19,13,19,20],[20,13,20,20],[21,13,21,20],[0,12,0,23],[23,3,24,10],[23,11,24,12],[23,13,24,20],[6,3,6,9],[7,3,7,9],[8,3,8,9],[10,3,10,9],[6,15,6,19],[7,15,7,19],[8,15,8,19],[9,15,9,19],[0,1,0,11],[2,2,2,22],[1,2,1,22],[4,15,4,19]]}
[{"$f":"CONCATENATE(\"Equipe\",\" \",'2.Pré. Eq'!AN5)","v":"Equipe "},"  5. Visibilité sur le Web (Facultatif)",null,null,null,null,null,null,null,null,null,null,"5. الوضوح على شبكة الانترنت (إختياري)",null,null,null,null,null,null,null,null,null,null,null,{"$f":"CONCATENATE(\"فرقة\",\" \",'2.Pré. Eq'!AN5)","v":"فرقة "}]
[null,null,"Visibilité de l’équipe sur le web"]
[]
[]
[null,null,null,"Visibilité de l’équipe sur le web",null,null,null,null,null,null,null,"% ",null,"Valeur",null,"وضوح الفرقة على شبكة الانترنت"]
[]
[null,null,null,"a)  Référencement du site web dans des moteurs de recherche scientifique spécialisée.",null,null,null,null,null,null,null,null,null,null,null,"أ) مرجعية موقع الانترنت ضمن محركات البحث العلمية المتخصصة"]
[null,null,null,"b) Nombre des pages du site web de l’équipe","b) Nombre des pages du site web du l’équipe","b) Nombre des pages du site web du l’équipe","b) Nombre des pages du site web du l’équipe",null,null,null,null,null,null,null,null,"ب) عدد صفحات موقع الفرقة على شبكة الانترنت","ب) عدد صفحات موقع الفرقة على شبكة الانترنت","ب) عدد صفحات موقع الفرقة على شبكة الانترنت","ب) عدد صفحات موقع الفرقة على شبكة الانترنت","ب) عدد صفحات موقع الفرقة على شبكة الانترنت"]
[null,null,null,"c) Nombre des documents en format pdf, ps, doc, docs, ppt, tex, référencés dans moteurs de recherche scientifique spécialisée","c) Nombre des documents en format pdf, ps, doc, docs, ppt, tex, référencés dans google scholar","c) Nombre des documents en format pdf, ps, doc, docs, ppt, tex, référencés dans google scholar","c) Nombre des documents en format pdf, ps, doc, docs, ppt, tex, référencés dans google scholar",null,null,null,null,null,null,null,null,"ج) عدد الوثائق في شكل pdf, ps, doc, docs, ppt, tex التي أشير إليها في محركات البحث العلمية المتخصصة"]
[null,null,null,"Google citation",null,null,null,null,null,null,null,null,null,null,null,"إحالة قوقل"]
[null,null,null,"Total",null,null,null,null,null,null,null,null,null,null,null,"المجموع"]
[]
[]
[]
[]
[]
[]
[null,null,null,"Bilan Récapitulatif de l’Equipe 1"]
[]
[null,null,null," 1. Production scientifique",null,null,null,null,null,null,null,{"$f":"Eq.PS!R180","v":0},null,"1. الإنتاج العلمي"]
[null,null,null," 2. Rayonnement, visibilité et attractivité académique",null,null,null,null,null,null,null,{"$f":"Eq.Ray!N336","v":0},null,"2. الإشعاع، المقروئية والاستقطاب الأكاديمي"]
[null,null,null," 3. Adéquation et interactions avec l’environnement économique, culturel et social",null,null,null,null,null,null,null,{"$f":"Eq.Adéq!K61","v":0},null,"3. التلاؤم والتفاعل مع المحيط الاقتصادي والثقافي والاجتماعي"]
[null,null,null," 4. Visibilité sur le web",null,null,null,null,null,null,null,null,null,"4. الوضوح على شبكة الانترنت"]
[null,null,null,"Total",null,null,null,null,null,null,null,{"$f":"SUM(L20:M22)","v":0},null,"مجموع"]

{"sheet":"Manuel d'utilisation","index":6,"n_rows":329,"n_cols":12,"rows_kept":329,"cut":false,"hidden":false,"merged":[[312,1,312,2],[313,0,319,0],[0,0,0,2],[1,0,1,2],[224,0,224,2]]}
[]
["Classification des branches scientifiques"]
["Code","Grandes thématiques (Français)","Grandes thématiques (Anglais)"]
["GT1","Sciences et techniques","Sciences and technics"]
["GT2","Sciences sociales, humaines et arts","Social sciences,humanities and arts"]
[]
["Code","Grands domaines (Français)","Grands domains (Anglais)"]
["GD1","Sciences de la nature et de la vie","Natural sciences and life","S&T"]
["GD2","Sciences de la terre et de l’univers","Earth science and the universe","S&T",null,null,null,null,null,null,null,"Chimie"]
["GD3","Sciences de la physique","Physics sciences","S&T",null,null,null,null,null,null,null,"Sciences de la terre et de l’univers"]
["GD4","Chimie","Chemistry","SHS",null,null,null,null,null,null,null,"Sciences pour l’ingénieur"]
["GD5","Sciences mathématiques et leurs interactions","Mathematical sciences and their interactions","S&T",null,null,null,null,null,null,null,"Sciences de la nature et de la vie"]
["GD6","Sciences pour l’ingénieur","Engineering sciences","S&T",null,null,null,null,null,null,null,"Sciences mathématiques et leurs interactions"]
["GD7","Sciences sociales","Social sciences","S&T",null,null,null,null,null,null,null,"Sciences de la physique"]
["GD8","Sciences humaines et arts","Humanities sciences and arts","SHS",null,null,null,null,null,null,null,"Multidisciplinaire"]
["GD9","Multidisciplinaire","Multidisciplinary","SHS"]
["GD9","Multidisciplinaire","Multidisciplinary","S&T"]
[]
["Code","Domaines (Français)"]
["D1","Physique et Astronomie",null,"S&T",null,null,null,null,null,"Agriculture et sciences vétérinaires",null,"Sciences humaines et arts"]
["D2","Chimie",null,"S&T",null,null,null,null,null,"Biologie et biochimie",null,"Sciences sociales"]
["D3","Mathématiques",null,"S&T",null,null,null,null,null,"Chimie",null,"Multidisciplinaire"]
["D4","Sciences de la Terre et des Planètes",null,"S&T",null,null,null,null,null,"Informatique et télécommunications"]
["D5","Sciences de l'Environnement",null,null,null,null,null,null,null,"Sciences de la terre"]
["D6","Sciences des Matériaux",null,null,null,null,null,null,null,"Economie et finance"]
["D7","Energie",null,null,null,null,null,null,null,"Engineering",null,"Agriculture et sciences vétérinaires"]
["D8","Ingénierie",null,null,null,null,null,null,null,"Environnement et écologie",null,"Biologie et biochimie"]
["D9","Génie Chimique",null,null,null,null,null,null,null,"Sciences des matériaux",null,"Chimie"]
["D10","Informatique",null,null,null,null,null,null,null,"Mathématiques",null,"Informatique et télécommunications"]
["D11","Dentisterie",null,null,null,null,null,null,null,"Medecine",null,"Sciences de la terre"]
["D12","Professions de la Santé",null,null,null,null,null,null,null,"Neuroscience",null,"Economie et finance"]
["D13","Médecine",null,null,null,null,null,null,null,"Pharmacologie",null,"Engineering"]
["D14","Profession d'Infirmier",null,null,null,null,null,null,null,"Physique",null,"Environnement et écologie"]
["D15","Sciences Vétérinaires",null,null,null,null,null,null,null,"Sciences de l’univers",null,"Sciences des matériaux"]
["D16","Sciences Sociales",null,null,null,null,null,null,null,"Sciences humaines et arts",null,"Mathématiques"]
["D17","Economie, Econométrie et Finances",null,null,null,null,null,null,null,"Psychologie et sciences cognitives",null,"Medecine"]
["D18","Commerce, Gestion et Comptabilité",null,null,null,null,null,null,null,"Sciences sociales",null,"Neuroscience"]
["D19","Sciences de la Décision",null,null,null,null,null,null,null,null,null,"Pharmacologie"]
["D20","Psychologies",null,null,null,null,null,null,null,null,null,"Physique"]
["D21","Arts et Sciences Humaines",null,null,null,null,null,null,null,null,null,"Sciences de l’univers"]
["D22","Agronomie et Biologie",null,null,null,null,null,null,null,null,null,"Multidisciplinaire"]
["D23","Biochimie, Génétique et biologie moléculaire"]
["D24","Immunologie et Microbiologie"]
["D25","Neurologie",null,null,null,null,null,null,null,null,null,"Sciences humaines et arts"]
["D26","Pharmacologie, Toxicologie et Pharmaceutique",null,null,null,null,null,null,null,null,null,"Psychologie et sciences cognitives"]
["D27","Multidisciplinaire",null,null,null,null,null,null,null,null,null,"Sciences sociales"]
[null,null,null,null,null,null,null,null,null,null,null,"Multidisciplinaire"]
["Code","Micro-domaines de la grande thématique Sciences et techniques (Français)","Micro-domaines de la grande thématique Sciences et techniques (Anglais)","  ",null,"Code","Micro Domaines de la grande thématique Sciences sociales, humaines et arts (Français)","Micro-domaines de la grande thématique Sciences sociales, humaines et arts (Anglais)"]
["MD1","Acoustiques","Acoustics","  ",null,"MD177","Anthropologie ","Anthropology"]
["MD2","Économie agricole et politique","Agricultural Economics & Policy","  ",null,"MD178","Littérature et langue arabe","Arabic Language and Literature"]
["MD3","Génie agricole","Agricultural Engineering","  ",null,"MD179","Archéologie ","Archaeology"]
["MD4","Agriculture, produits laitiers et  science des animaux","Agriculture, Dairy & Animal Science","  ",null,"MD180","Architecture","Architecture"]
["MD5","Agriculture, multidisciplinaire","Agriculture, Multidisciplinary","  ",null,"MD181","Études des domaines sociaux","Area Studies"]
["MD6","Agronomie","Agronomy","  ",null,"MD182","Art","Art"]
["MD7","Allergie","Allergy","  ",null,"MD183","Études asiatiques","Asian Studies"]
["MD8","Anatomie et morphologie ","Anatomy & Morphology","  ",null,"MD184","Entreprise ","Business"]
["MD9","Andrologie ","Andrology","  ",null,"MD185","Affaires et Finance ","Business, Finance"]
["MD10","Anesthésiologie ","Anesthesiology","  ",null,"MD186","Classiques","Classics"]
["MD11","Astronomie et astrophysique ","Astronomy & Astrophysics","  ",null,"MD187","Communication ","Communication"]
["MD12","Audiologie et orthophonie","Audiology Speech Language Pathology","  ",null,"MD188","Criminologie et pénologie ","Criminology & Penology"]
["MD13","Automation et systèmes de contrôle ","Automation & Control Systems","  ",null,"MD189","Etudes culturelles","Cultural Studies"]
["MD14","Sciences du comportement ","Behavioral Sciences","  ",null,"MD190","Danse ","Dance"]
["MD15","Méthodes de recherche biochimique ","Biochemical Research Methods","  ",null,"MD191","Démographie ","Demography"]
["MD16","Biochimie et biologie moléculaire","Biochemistry & Molecular Biology","  ",null,"MD192","Économie ","Economics"]
["MD17","Conservation de la biodiversité ","Biodiversity Conservation","  ",null,"MD193","Éducation et recherche en éducation ","Education & Educational Research"]
["MD18","Biologie ","Biology","  ",null,"MD194","Éducation spéciale ","Education, Special"]
["MD19","Biophysique ","Biophysics","  ",null,"MD195","Études environnementales ","Environmental Studies"]
["MD20","Biotechnologie et microbiologie appliquée ","Biotechnology & Applied Microbiology","  ",null,"MD196","Ergonomie ","Ergonomics"]
["MD21","Systèmes cardiaques et cardiovasculaires ","Cardiac & Cardiovascular Systems","  ",null,"MD197","Éthique ","Ethics"]
["MD22","Biologie cellulaire ","Cell & Tissue Engineering","  ",null,"MD198","Études ethniques ","Ethnic Studies"]
["MD23","Cellule et génie tissulaire ","Cell Biology","  ",null,"MD199","Études familiales ","Family Studies"]
["MD24","Chimie analytique ","Chemistry, Analytical","  ",null,"MD200","Cinéma, Radio, télévision","Film, Radio, Television"]
["MD25","Chimie appliquée ","Chemistry, Applied","  ",null,"MD201","Folklore","Folklore"]
["MD26","Chimie inorganique et nucléaire ","Chemistry, Inorganic & Nuclear","  ",null,"MD202","Géographie ","Geography"]
["MD27","Chimie médicinal ","Chemistry, Medicinal","  ",null,"MD203","Gérontologie ","Gerontology"]
["MD28","Chimie multidisciplinaire ","Chemistry, Multidisciplinary","  ",null,"MD204","La politique de santé et de Services ","Health Policy & Services"]
["MD29","Chimie organique ","Chemistry, Organic","  ",null,"MD205","Histoire ","History"]
["MD30","Chimie physique ","Chemistry, Physical","  ",null,"MD206","Histoire et philosophie des sciences ","History & Philosophy of Science"]
["MD31","Neurologie clinique ","Clinical Neurology","  ",null,"MD207","Histoire des Sciences sociales ","History of Social Sciences"]
["MD32","Informatique et Intelligence artificielle ","Computer Science, Artificial Intelligence","  ",null,"MD208","Hospitalité, loisirs, Sport et tourisme ","Hospitality, Leisure, Sport & Tourism"]
["MD33","Informatique et Cybernétique ","Computer Science, Cybernetics","  ",null,"MD209","Humaines, multidisciplinaire","Humanities, Multidisciplinary"]
["MD34","Informatique, matériel et Architecture ","Computer Science, Hardware & Architecture","  ",null,"MD210","Relations industrielles et travail ","Industrial Relations & Labor"]
["MD35","Informatique et systèmes d'Information ","Computer Science, Information Systems","  ",null,"MD211","Sciences de l'information et bibliothéconomie ","Information Science & Library Science"]
["MD36","Informatique et Applications interdisciplinaires ","Computer Science, Interdisciplinary Applications","  ",null,"MD212","Relations internationales ","International Relations"]
["MD37","Informatique et génie logiciel ","Computer Science, Software Engineering","  ",null,"MD213","Sciences islamiques","Islamic Sciences"]
["MD38","Informatique : théorie et méthodes","Computer Science, Theory & Methods","  ",null,"MD214","Langue et la linguistique","Language & Linguistics"]
["MD39","Construction et technologie du bâtiment ","Construction & Building Technology","  ",null,"MD215","Droit ","Law"]
["MD40","Médecine des soins intensifs ","Critical Care Medicine","  ",null,"MD216","Linguistique ","Linguistics"]
["MD41","Cristallographie ","Crystallography","  ",null,"MD217","Critiques littéraires","Literary Reviews"]
["MD42","Dentisterie, chirurgie buccale et médecine ","Dentistry, Oral Surgery & Medicine","  ",null,"MD218","La théorie littéraire et critique","Literary Theory & Criticism"]
["MD43","Dermatologie ","Dermatology","  ",null,"MD219","Littérature","Literature"]
["MD44","Biologie du développement ","Developmental Biology","  ",null,"MD220","Littérature d’Afrique, d’Australie, et canadienne","Literature, African, Australian, Canadian"]
["MD45","Écologie","Ecology","  ",null,"MD221","Littérature Américaine","Literature, American"]
["MD46","Éducation, et Disciplines scientifiques ","Education, Scientific Disciplines","  ",null,"MD222","Littérature des îles britanniques","Literature, British Isles"]
["MD47","Électrochimie ","Electrochemistry","  ",null,"MD223","Littérature, allemande, néerlandaise et scandinave","Literature, German, Dutch, Scandinavian"]
["MD48","Médecine d'urgence ","Emergency Medicine","  ",null,"MD224","Littérature Romane","Literature, Romance"]
["MD49","Endocrinologie et métabolisme","Endocrinology & Metabolism","  ",null,"MD225","Littérature Slave","Literature, Slavic"]
["MD50","Énergie et carburants ","Energy & Fuels","  ",null,"MD226","Gestion ","Management"]
["MD51","Ingénierie, aérospatiale ","Engineering, Aerospace","  ",null,"MD227","Études médiévales et Renaissance","Medieval & Renaissance Studies"]
["MD52","Génie biomédical ","Engineering, Biomedical","  ",null,"MD228","Musique","Music"]
["MD53","Génie chimique ","Engineering, Chemical","  ",null,"MD229","Soins infirmiers ","Nursing"]
["MD54","Génie civile ","Engineering, Civil","  ",null,"MD230","Philosophie","Philosophy"]
["MD55","Génie électrique et électronique ","Engineering, Electrical & Electronic","  ",null,"MD231","Planification et développement ","Planning & Development"]
["MD56","Génie de l’environnement ","Engineering, Environmental","  ",null,"MD232","Poésie","Poetry"]
["MD57","Génie géologique ","Engineering, Geological","  ",null,"MD233","Science politique ","Political Science"]
["MD58","Génie industriel ","Engineering, Industrial","  ",null,"MD234","Psychiatrie ","Psychiatry"]
["MD59","Génie de fabrication ","Engineering, Manufacturing","  ",null,"MD235","Psychologie appliquée ","Psychology, Applied"]
["MD60","Génie marin ","Engineering, Marine","  ",null,"MD236","Psychologie biologique ","Psychology, Biological"]
["MD61","Génie mécanique ","Engineering, Mechanical","  ",null,"MD237","Psychologie clinique ","Psychology, Clinical"]
["MD62","Ingénierie multidisciplinaire ","Engineering, Multidisciplinary","  ",null,"MD238","Psychologie du développement ","Psychology, Developmental"]
["MD63","Ingénierie océane ","Engineering, Ocean","  ",null,"MD239","Psychologie de l’éducation ","Psychology, Educational"]
["MD64","Génie du pétrole ","Engineering, Petroleum","  ",null,"MD240","Psychologie expérimentale ","Psychology, Experimental"]
["MD65","Entomologie ","Entomology","  ",null,"MD241","Psychologie mathématique ","Psychology, Mathematical"]
["MD66","Sciences de l'environnement ","Environmental Sciences","  ",null,"MD242","Psychologie multidisciplinaire ","Psychology, Multidisciplinary"]
["MD67","Biologie de l'évolution ","Evolutionary Biology","  ",null,"MD243","Psychologie et psychanalyse ","Psychology, Psychoanalysis"]
["MD68","Pêche ","Fisheries","  ",null,"MD244","Psychologie sociale ","Psychology, Social"]
["MD69","Science des aliments et technologie ","Food Science & Technology","  ",null,"MD245","Administration publique ","Public Administration"]
["MD70","Forêts","Forestry","  ",null,"MD246","Santé publique, environnementale et du travail ","Public, Environmental & Occupational Health"]
["MD71","Gastro-entérologie et hépatologie ","Gastroenterology & Hepatology","  ",null,"MD247","Réhabilitation","Rehabilitation"]
["MD72","Génétique et hérédité ","Genetics & Heredity","  ",null,"MD248","Religion","Religion"]
["MD73","Géochimie et géophysique ","Geochemistry & Geophysics","  ",null,"MD249","Questions sociales ","Social Issues"]
["MD74","Géographie physique","Geography, Physical","  ",null,"MD250","Sciences sociales, biomédicales ","Social Sciences, Biomedical"]
["MD75","Géologie ","Geology","  ",null,"MD251","Sciences sociales, interdisciplinaires ","Social Sciences, Interdisciplinary"]
["MD76","Sciences de la terre, multidisciplinaires ","Geosciences, Multidisciplinary","  ",null,"MD252","Sciences sociales et méthodes mathématiques ","Social Sciences, Mathematical Methods"]
["MD77","Gériatrie et gérontologie ","Geriatrics & Gerontology","  ",null,"MD253","Travail social ","Social Work"]
["MD78","Sciences de la santé et de Services ","Health Care Sciences & Services","  ",null,"MD254","Sociologie ","Sociology"]
["MD79","Hématologie ","Hematology","  ",null,"MD255","Abus de substances","Substance Abuse"]
["MD80","Histoire et philosophie des sciences ","History & Philosophy of Science","  ",null,"MD256","Littérature et culture tamazight","Tamazight Language and Culture"]
["MD81","Horticulture ","Horticulture","  ",null,"MD257","Théâtre","Theater"]
["MD82","Science de l’Imagerie et technologie photographique ","Imaging Science & Photographic Technology","  ",null,"MD258","Transports ","Transportation"]
["MD83","Immunologie ","Immunology","  ",null,"MD259","Études urbaines ","Urban Studies"]
["MD84","Maladies infectieuses ","Infectious Diseases","  ",null,"MD260","Études féminines ","Women's Studies"]
["MD85","Instruments et Instrumentation ","Instruments & Instrumentation","  "]
["MD86","Médecine intégrative et complémentaire ","Integrative & Complementary Medicine","  "]
["MD87","Limnologie ","Limnology","  "]
["MD88","Logique","Logic","  "]
["MD89","Biologie marine et d'eau douce ","Marine & Freshwater Biology","  "]
["MD90","Science des matériaux, biomatériaux ","Materials Science, Biomaterials","  "]
["MD91","Science des matériaux, céramiques","Materials Science, Ceramics","  "]
["MD92","Science des matériaux, caractérisation et mise à l'essai ","Materials Science, Characterization & Testing","  "]
["MD93","Science des matériaux, revêtements et Films","Materials Science, Coatings & Films","  "]
["MD94","Science des matériaux, Composites ","Materials Science, Composites","  "]
["MD95","Science des matériaux, multidisciplinaire ","Materials Science, Multidisciplinary","  "]
["MD96","Science des matériaux, papier et bois ","Materials Science, Paper & Wood","  "]
["MD97","Science des matériaux, Textiles ","Materials Science, Textiles","  "]
["MD98","Mathématique et informatique en Biologie","Mathematical & Computational Biology","  "]
["MD99","Mathématiques ","Mathematics","  "]
["MD100","Mathématiques appliquées ","Mathematics, Applied","  "]
["MD101","Mathématiques, Applications interdisciplinaires ","Mathematics, Interdisciplinary Applications","  "]
["MD102","Mécanique ","Mechanics","  "]
["MD103","Éthique médicale ","Medical Ethics","  "]
["MD104","Informatique médicale ","Medical Informatics","  "]
["MD105","Technologie de laboratoire médical ","Medical Laboratory Technology","  "]
["MD106","Médecine générale et interne ","Medicine, General & Internal","  "]
["MD107","Médecine légale ","Medicine, Legal","  "]
["MD108","Médecine, recherche et expérimentation ","Medicine, Research & Experimental","  "]
["MD109","Métallurgie et génie métallurgique ","Metallurgy & Metallurgical Engineering","  "]
["MD110","Météorologie et Sciences de l’atmosphère ","Meteorology & Atmospheric Sciences","  "]
["MD111","Microbiologie ","Microbiology","  "]
["MD112","Microscopie ","Microscopy","  "]
["MD113","Minéralogie ","Mineralogy","  "]
["MD114","Mines et traitement des minéraux ","Mining & Mineral Processing","  "]
["MD115","Sciences multidisciplinaires ","Multidisciplinary Sciences","  "]
["MD116","Mycologie ","Mycology","  "]
["MD117","Nanosciences et nanotechnologies ","Nanoscience & Nanotechnology","  "]
["MD118","Neuro-imagerie ","Neuroimaging","  "]
["MD119","Neurosciences ","Neurosciences","  "]
["MD120","Science nucléaire et technologie ","Nuclear Science & Technology","  "]
["MD121","Soins infirmiers ","Nursing","  "]
["MD122","Nutrition et diététique ","Nutrition & Dietetics","  "]
["MD123","Obstétrique et gynécologie ","Obstetrics & Gynecology","  "]
["MD124","Océanographie ","Oceanography","  "]
["MD125","Oncologie ","Oncology","  "]
["MD126","Recherche opérationnelle  et sciences de gestion ","Operations Research & Management Science","  "]
["MD127","Ophtalmologie ","Ophthalmology","  "]
["MD128","Optique ","Optics","  "]
["MD129","Ornithologie ","Ornithology","  "]
["MD130","Orthopédie ","Orthopedics","  "]
["MD131","Oto-rhino-laryngologie ","Otorhinolaryngology","  "]
["MD132","Paléontologie ","Paleontology","  "]
["MD133","Parasitologie ","Parasitology","  "]
["MD134","Pathologie ","Pathology","  "]
["MD135","Pédiatrie ","Pediatrics","  "]
["MD136","Pharmacologie et pharmacie ","Peripheral Vascular Disease","  "]
["MD137","Maladies vasculaires périphériques ","Pharmacology & Pharmacy","  "]
["MD138","Physique, appliquée","Physics, Applied","  "]
["MD139","Physique atomique et moléculaire et chimique ","Physics, Atomic, Molecular & Chemical","  "]
["MD140","Physique de la matière condensée ","Physics, Condensed Matter","  "]
["MD141","Physique, fluides et Plasmas ","Physics, Fluids & Plasmas","  "]
["MD142","Physique mathématique ","Physics, Mathematical","  "]
["MD143","Physique, multidisciplinaire ","Physics, Multidisciplinary","  "]
["MD144","Physique nucléaire ","Physics, Nuclear","  "]
["MD145","Physique des particules et des champs ","Physics, Particles & Fields","  "]
["MD146","Physiologie ","Physiology","  "]
["MD147","Sciences des plantes ","Plant Sciences","  "]
["MD148","Science des polymères ","Polymer Science","  "]
["MD149","Soins de santé primaires","Primary Health Care","  "]
["MD150","Psychiatrie ","Psychiatry","  "]
["MD151","Psychologie ","Psychology","  "]
["MD152","Santé publique, environnementale et du travail ","Public, Environmental & Occupational Health","  "]
["MD153","Radiologie, médecine nucléaire et l'imagerie médicale ","Radiology, Nuclear Medicine & Medical Imaging","  "]
["MD154","Réhabilitation","Rehabilitation","  "]
["MD155","Télédétection ","Remote Sensing","  "]
["MD156","Biologie de la reproduction ","Reproductive Biology","  "]
["MD157","Système respiratoire ","Respiratory System","  "]
["MD158","Rhumatologie ","Rheumatology","  "]
["MD159","Robotique ","Robotics","  "]
["MD160","Science des sols ","Soil Science","  "]
["MD161","Spectroscopie  ","Spectroscopy","  "]
["MD162","Sciences du sport ","Sport Sciences","  "]
["MD163","Statistiques et probabilités ","Statistics & Probability","  "]
["MD164","Abus de substances","Substance Abuse","  "]
["MD165","Chirurgie ","Surgery","  "]
["MD166","Télécommunications ","Telecommunications","  "]
["MD167","Thermodynamique ","Thermodynamics","  "]
["MD168","Toxicologie ","Toxicology","  "]
["MD169","Transplantation ","Transplantation","  "]
["MD170","Science du Transport et technologie ","Transportation Science & Technology","  "]
["MD171","Médecine tropicale ","Tropical Medicine","  "]
["MD172","Urologie et néphrologie ","Urology & Nephrology","  "]
["MD173","Sciences vétérinaires ","Veterinary Sciences","  "]
["MD174","Virologie ","Virology","  "]
["MD175","Ressources en eau","Water Resources","  "]
["MD176","Zoologie ","Zoology","  "]
["Les Etablissements Universitaire"]
["N°","Etablissement"]
[1,"Centre Universitaire Ain Temouchent"]
[2,"Centre Universitaire de Tamanrasset"]
[3,"Centre Universitaire El Bayadh"]
[4,"Centre Universitaire Mila"]
[5,"Centre Universitaire Naama"]
[6,"Centre Universitaire Relizane"]
[7,"Centre Universitaire Tipaza"]
[8,"Centre Universitaire Tissemssilt"]
[9,"Ecole des Hautes Etudes Commerciales"]
[10,"Ecole National des Mines Annaba"]
[11,"Ecole Nationale Polytechnique"]
[12,"Ecole Nationale polytechnique ENSET Oran"]
[13,"Ecole Nationale Supérieure Agronomie"]
[14,"Ecole nationale supérieure de journalisme et des sciences de information"]
[15,"Ecole Nationale Supérieure des Sciences Commerciales et Finacieres ESC"]
[16,"Ecole Nationale Supérieure des Sciences de la Mer et de Aménagement du Littoral"]
[17,"Ecole Nationale Supérieure des Travaux Publics"]
[18,"Ecole Nationale Supérieure en Informatique"]
[19,"Ecole Nationale Supérieure en Sciences et Technologie du Sport"]
[20,"Ecole Nationale Supérieure en Statistique et en Economie Appliquée"]
[21,"Ecole Nationale Supérieure Hydraulique"]
[22,"Ecole Nationale Supérieure Informatique Sidi Bel Abbes"]
[23,"Ecole Nationale Vétérinaire"]
[24,"Ecole Normale Superieure de Constantine"]
[25,"Ecole Normale Supérieure de Kouba"]
[26,"Ecole Normale Supérieure de Laghouat"]
[27,"Ecole Normale Supérieure des Lettres et Sciences Sociales Bouzaréah"]
[28,"Ecole Polytechnique Architecteur et Urbanisme"]
[29,"Ecole Préparatoire en Sciences Economiques Commerciales et de Gestion"]
[30,"Institut de Maritime Bousmail"]
[31,"Institut National de la Poste et des TIC"]
[32,"Institut National des Télécommunications et des Technologies de Information et de la Communication Oran"]
[33,"Institut Pasteur Algérie"]
[34,"Université 20 Août 1955 de Skikda"]
[35,"Université 8 mai 1945 de Guelma"]
[36,"Université Abdelhamid Ibn Badis de Mostaganem"]
[37,"Université Abderrahmane Mira de Béjaia"]
[38,"Université Abou Elkacem Saad Allah Alger 2"]
[39,"Université Aboubeker Belkaid de Tlemcen"]
[40,"Université Ahmed Ben Bella Es Senia Oran 1"]
[41,"Université Ahmed Bougara dit Si Mhamed de Boumerdès"]
[42,"Université Ahmed Draya Adrar"]
[43,"Université Akli Mohand Oulhadj de Bouira"]
[44,"Université Alger 3"]
[45,"Université Badji Mokhtar de Annaba"]
[46,"Université Batna 2"]
[47,"Université Benyoucef Benkhedda Alger"]
[48,"Université Chadli Bendjedid El Tarf"]
[49,"Université de Abdelhamid Mehri de Constantine 2"]
[50,"Université de Constantine 3"]
[51,"Université de Ghardaïa"]
[52,"Université de Khenchela"]
[53,"Université des Sciences et de la Technologie Houari Boumediène USTHB"]
[54,"Université des Sciences et de la Technologie Mohamed Boudiaf Oran"]
[55,"Université des Sciences Islamiques Emir Abdelkader de Constantine"]
[56,"Université El Djilali Bounaama dit Si Mhamed de Khemis Miliana"]
[57,"Université El Djilali Liabès de Sidi Bel Abbès"]
[58,"Université El Hadj Lakhdar de Batna 1"]
[59,"Université Ferhat Abbes de Sétif 1"]
[60,"Université Frères Mentouri de Constantine 1"]
[61,"Université Hassiba Ben Bouali de Chlef"]
[62,"Université Ibn Khaldoun de Tiaret"]
[63,"Université Kasdi Merbah de Ouargla"]
[64,"Université Lamine Debaghine de Sétif 2"]
[65,"Université Larbi Ben Mhidi de Oum El Bouaghi"]
[66,"Université Larbi Tebessi de Tébessa"]
[67,"Université Lounici Ali de Blida 2"]
[68,"Université Mohamed Ben Ahmed Oran 2"]
[69,"Université Mohamed Boudiaf de Msila"]
[70,"Université Mohamed Cherif Mesaadia de Souk Ahras"]
[71,"Université Mohamed El Bachir El Ibrahimi de Bordj Bou Arréridj"]
[72,"Université Mohamed Essedik Ben Yahia de Jijel"]
[73,"Université Mohamed Khider de Biskra"]
[74,"Université Mohamed Lakhdar Ben Amara dit Hamma Lakhdar El Oued"]
[75,"Université Mouloud Maameri de Tizi Ouzou"]
[76,"Université Mustapha Stambouli de Mascara"]
[77,"Université Omar Telidji de Laghouat"]
[78,"Université Saad Dahlab de Blida 1"]
[79,"Université Tahar Moulay de Saida"]
[80,"Université Tahri Mohamed de Béchar"]
[81,"Université Yahia Farès de Médéa"]
[82,"Université Ziane Achour de Djelfa"]
[]
[]
[]
[]
[null,"Autres"]
[null,"Grade","Abréviation Grade"]
[null,"Professeur","Professeur"]
[null,"Maitre de Conférence A","MCA"]
[null,"Maitre de Conférence B","MCB"]
[null,"Maitre Assistant A","MAA"]
[null,"Maitre Assistant A Doctorant","MAA, Doc."]
[null,"Maitre Assistant B","MAB"]
[null,"Maitre Assistant B Doctorant","MAB, Doc."]
[null,"Doctorant","Doctorant"]
[null,"Dernier diplôme obtenu"]
[null,"Doc. d'Etat"]
[null,"Doctorat"]
[null,"DESM"]
[null,"Magister"]
[null,"DEMS"]
[null,"Master"]

{"sheet":"Feuil2","index":7,"n_rows":1222,"n_cols":10,"rows_kept":1222,"cut":false,"hidden":true,"merged":[[218,0,224,0]]}
[null,null,null,"Code","Grandes thématiques (Français)","Grandes thématiques (Anglais)"]
[null,null,null,"GT1","Sciences et techniques","Sciences and technics"]
[null,null,null,"GT2","Sciences sociales, humaines et arts","Social sciences,humanities and arts"]
[]
[null,null,null,"Code","Grands domaines (Français)","Grands domains (Anglais)"]
[null,null,null,"GD1","Chimie","Chemistry"]
[null,null,null,"GD2","Sciences de la terre et de l’univers","Earth science and the universe"]
[null,null,null,"GD3","Sciences pour l’ingénieur","Engineering sciences"]
[null,null,null,"GD5","Sciences de la nature et de la vie","Natural sciences and life"]
[null,null,null,"GD6","Sciences mathématiques et leurs interactions","Mathematical sciences and their interactions"]
[null,null,null,"GD7","Sciences de la physique","Physics sciences"]
[null,null,null,"GD9","Multidisciplinaire","Multidisciplinary"]
[null,null,null,"GD4","Sciences humaines et arts","Humanities sciences and arts"]
[null,null,null,"GD8","Sciences sociales","Social sciences"]
[null,null,null,"GD9","Multidisciplinaire","Multidisciplinary"]
[]
[null,null,null,"Code","Domaines (Français)","Domains (Anglais)",null,null,null,"Domaine"]
[null,null,null,"D1","Agriculture et sciences vétérinaires","Agriculture sciences and veterinary",null,null,null,"Agriculture et sciences vétérinaires"]
[null,null,null,"D2","Biologie et biochimie","Biology and Biochemistry",null,null,null,"Biologie et biochimie"]
[null,null,null,"D3","Chimie","Chemistry",null,null,null,"Chimie"]
[null,null,null,"D4","Informatique et télécommunications","Computer science and telecommunications",null,null,null,"Informatique et télécommunications"]
[null,null,null,"D5","Sciences de la terre","Earth sciences",null,null,null,"Sciences de la terre"]
[null,null,null,"D6","Economie et finance","Economy and finance",null,null,null,"Economie et finance"]
[null,null,null,"D7","Engineering","Engineering",null,null,null,"Engineering"]
[null,null,null,"D8","Environnement et écologie","Environment and Ecology",null,null,null,"Environnement et écologie"]
[null,null,null,"D10","Sciences des matériaux","Material sciences",null,null,null,"Sciences des matériaux"]
[null,null,null,"D11","Mathématiques","Mathematics",null,null,null,"Mathématiques"]
[null,null,null,"D12","Medecine","Medecine",null,null,null,"Medecine"]
[null,null,null,"D13","Neuroscience","Neuroscience",null,null,null,"Neuroscience"]
[null,null,null,"D14","Pharmacologie","Pharmacology",null,null,null,"Pharmacologie"]
[null,null,null,"D15","Physique","Physic",null,null,null,"Physique"]
[null,null,null,"D18","Sciences de l’univers","Universe sciences",null,null,null,"Sciences de l’univers"]
[null,null,null,"D19","Multidisciplinaire","Multidisciplinary",null,null,null,"Sciences humaines et arts"]
[null,null,null,"D9","Sciences humaines et arts","Humanities sciences and arts",null,null,null,"Psychologie et sciences cognitives"]
[null,null,null,"D16","Psychologie et sciences cognitives","Psychology and cognitive sciences",null,null,null,"Sciences sociales"]
[null,null,null,"D17","Sciences sociales","Social sciences",null,null,null,"Multidisciplinaire"]
[null,null,null,"D19","Multidisciplinaire","Multidisciplinary"]
[]
["Code","Micro-domaines de la grande thématique Sciences et techniques (Français)","Micro-domaines de la grande thématique Sciences et techniques (Anglais)","  ","Code","Micro Domaines de la grande thématique Sciences sociales, humaines et arts (Français)"]
["MD1","Acoustiques","Acoustics","  ","MD177","Anthropologie "]
["MD2","Économie agricole et politique","Agricultural Economics & Policy","  ","MD178","Littérature et langue arabe"]
["MD3","Génie agricole","Agricultural Engineering","  ","MD179","Archéologie "]
["MD4","Agriculture, produits laitiers et  science des animaux","Agriculture, Dairy & Animal Science","  ","MD180","Architecture"]
["MD5","Agriculture, multidisciplinaire","Agriculture, Multidisciplinary","  ","MD181","Études des domaines sociaux"]
["MD6","Agronomie","Agronomy","  ","MD182","Art"]
["MD7","Allergie","Allergy","  ","MD183","Études asiatiques"]
["MD8","Anatomie et morphologie ","Anatomy & Morphology","  ","MD184","Entreprise "]
["MD9","Andrologie ","Andrology","  ","MD185","Affaires et Finance "]
["MD10","Anesthésiologie ","Anesthesiology","  ","MD186","Classiques"]
["MD11","Astronomie et astrophysique ","Astronomy & Astrophysics","  ","MD187","Communication "]
["MD12","Audiologie et orthophonie","Audiology Speech Language Pathology","  ","MD188","Criminologie et pénologie "]
["MD13","Automation et systèmes de contrôle ","Automation & Control Systems","  ","MD189","Etudes culturelles"]
["MD14","Sciences du comportement ","Behavioral Sciences","  ","MD190","Danse "]
["MD15","Méthodes de recherche biochimique ","Biochemical Research Methods","  ","MD191","Démographie "]
["MD16","Biochimie et biologie moléculaire","Biochemistry & Molecular Biology","  ","MD192","Économie "]
["MD17","Conservation de la biodiversité ","Biodiversity Conservation","  ","MD193","Éducation et recherche en éducation "]
["MD18","Biologie ","Biology","  ","MD194","Éducation spéciale "]
["MD19","Biophysique ","Biophysics","  ","MD195","Études environnementales "]
["MD20","Biotechnologie et microbiologie appliquée ","Biotechnology & Applied Microbiology","  ","MD196","Ergonomie "]
["MD21","Systèmes cardiaques et cardiovasculaires ","Cardiac & Cardiovascular Systems","  ","MD197","Éthique "]
["MD22","Biologie cellulaire ","Cell & Tissue Engineering","  ","MD198","Études ethniques "]
["MD23","Cellule et génie tissulaire ","Cell Biology","  ","MD199","Études familiales "]
["MD24","Chimie analytique ","Chemistry, Analytical","  ","MD200","Cinéma, Radio, télévision"]
["MD25","Chimie appliquée ","Chemistry, Applied","  ","MD201","Folklore"]
["MD26","Chimie inorganique et nucléaire ","Chemistry, Inorganic & Nuclear","  ","MD202","Géographie "]
["MD27","Chimie médicinal ","Chemistry, Medicinal","  ","MD203","Gérontologie "]
["MD28","Chimie multidisciplinaire ","Chemistry, Multidisciplinary","  ","MD204","La politique de santé et de Services "]
["MD29","Chimie organique ","Chemistry, Organic","  ","MD205","Histoire "]
["MD30","Chimie physique ","Chemistry, Physical","  ","MD206","Histoire et philosophie des sciences "]
["MD31","Neurologie clinique ","Clinical Neurology","  ","MD207","Histoire des Sciences sociales "]
["MD32","Informatique et Intelligence artificielle ","Computer Science, Artificial Intelligence","  ","MD208","Hospitalité, loisirs, Sport et tourisme "]
["MD33","Informatique et Cybernétique ","Computer Science, Cybernetics","  ","MD209","Humaines, multidisciplinaire"]
["MD34","Informatique, matériel et Architecture ","Computer Science, Hardware & Architecture","  ","MD210","Relations industrielles et travail "]
["MD35","Informatique et systèmes d'Information ","Computer Science, Information Systems","  ","MD211","Sciences de l'information et bibliothéconomie "]
["MD36","Informatique et Applications interdisciplinaires ","Computer Science, Interdisciplinary Applications","  ","MD212","Relations internationales "]
["MD37","Informatique et génie logiciel ","Computer Science, Software Engineering","  ","MD213","Sciences islamiques"]
["MD38","Informatique : théorie et méthodes","Computer Science, Theory & Methods","  ","MD214","Langue et la linguistique"]
["MD39","Construction et technologie du bâtiment ","Construction & Building Technology","  ","MD215","Droit "]
["MD40","Médecine des soins intensifs ","Critical Care Medicine","  ","MD216","Linguistique "]
["MD41","Cristallographie ","Crystallography","  ","MD217","Critiques littéraires"]
["MD42","Dentisterie, chirurgie buccale et médecine ","Dentistry, Oral Surgery & Medicine","  ","MD218","La théorie littéraire et critique"]
["MD43","Dermatologie ","Dermatology","  ","MD219","Littérature"]
["MD44","Biologie du développement ","Developmental Biology","  ","MD220","Littérature d’Afrique, d’Australie, et canadienne"]
["MD45","Écologie","Ecology","  ","MD221","Littérature Américaine"]
["MD46","Éducation, et Disciplines scientifiques ","Education, Scientific Disciplines","  ","MD222","Littérature des îles britanniques"]
["MD47","Électrochimie ","Electrochemistry","  ","MD223","Littérature, allemande, néerlandaise et scandinave"]
["MD48","Médecine d'urgence ","Emergency Medicine","  ","MD224","Littérature Romane"]
["MD49","Endocrinologie et métabolisme","Endocrinology & Metabolism","  ","MD225","Littérature Slave"]
["MD50","Énergie et carburants ","Energy & Fuels","  ","MD226","Gestion "]
["MD51","Ingénierie, aérospatiale ","Engineering, Aerospace","  ","MD227","Études médiévales et Renaissance"]
["MD52","Génie biomédical ","Engineering, Biomedical","  ","MD228","Musique"]
["MD53","Génie chimique ","Engineering, Chemical","  ","MD229","Soins infirmiers "]
["MD54","Génie civile ","Engineering, Civil","  ","MD230","Philosophie"]
["MD55","Génie électrique et électronique ","Engineering, Electrical & Electronic","  ","MD231","Planification et développement "]
["MD56","Génie de l’environnement ","Engineering, Environmental","  ","MD232","Poésie"]
["MD57","Génie géologique ","Engineering, Geological","  ","MD233","Science politique "]
["MD58","Génie industriel ","Engineering, Industrial","  ","MD234","Psychiatrie "]
["MD59","Génie de fabrication ","Engineering, Manufacturing","  ","MD235","Psychologie appliquée "]
["MD60","Génie marin ","Engineering, Marine","  ","MD236","Psychologie biologique "]
["MD61","Génie mécanique ","Engineering, Mechanical","  ","MD237","Psychologie clinique "]
["MD62","Ingénierie multidisciplinaire ","Engineering, Multidisciplinary","  ","MD238","Psychologie du développement "]
["MD63","Ingénierie océane ","Engineering, Ocean","  ","MD239","Psychologie de l’éducation "]
["MD64","Génie du pétrole ","Engineering, Petroleum","  ","MD240","Psychologie expérimentale "]
["MD65","Entomologie ","Entomology","  ","MD241","Psychologie mathématique "]
["MD66","Sciences de l'environnement ","Environmental Sciences","  ","MD242","Psychologie multidisciplinaire "]
["MD67","Biologie de l'évolution ","Evolutionary Biology","  ","MD243","Psychologie et psychanalyse "]
["MD68","Pêche ","Fisheries","  ","MD244","Psychologie sociale "]
["MD69","Science des aliments et technologie ","Food Science & Technology","  ","MD245","Administration publique "]
["MD70","Forêts","Forestry","  ","MD246","Santé publique, environnementale et du travail "]
["MD71","Gastro-entérologie et hépatologie ","Gastroenterology & Hepatology","  ","MD247","Réhabilitation"]
["MD72","Génétique et hérédité ","Genetics & Heredity","  ","MD248","Religion"]
["MD73","Géochimie et géophysique ","Geochemistry & Geophysics","  ","MD249","Questions sociales "]
["MD74","Géographie physique","Geography, Physical","  ","MD250","Sciences sociales, biomédicales "]
["MD75","Géologie ","Geology","  ","MD251","Sciences sociales, interdisciplinaires "]
["MD76","Sciences de la terre, multidisciplinaires ","Geosciences, Multidisciplinary","  ","MD252","Sciences sociales et méthodes mathématiques "]
["MD77","Gériatrie et gérontologie ","Geriatrics & Gerontology","  ","MD253","Travail social "]
["MD78","Sciences de la santé et de Services ","Health Care Sciences & Services","  ","MD254","Sociologie "]
["MD79","Hématologie ","Hematology","  ","MD255","Abus de substances"]
["MD80","Histoire et philosophie des sciences ","History & Philosophy of Science","  ","MD256","Littérature et culture tamazight"]
["MD81","Horticulture ","Horticulture","  ","MD257","Théâtre"]
["MD82","Science de l’Imagerie et technologie photographique ","Imaging Science & Photographic Technology","  ","MD258","Transports "]
["MD83","Immunologie ","Immunology","  ","MD259","Études urbaines "]
["MD84","Maladies infectieuses ","Infectious Diseases","  ","MD260","Études féminines "]
["MD85","Instruments et Instrumentation ","Instruments & Instrumentation","  "]
["MD86","Médecine intégrative et complémentaire ","Integrative & Complementary Medicine","  "]
["MD87","Limnologie ","Limnology","  "]
["MD88","Logique","Logic","  "]
["MD89","Biologie marine et d'eau douce ","Marine & Freshwater Biology","  "]
["MD90","Science des matériaux, biomatériaux ","Materials Science, Biomaterials","  "]
["MD91","Science des matériaux, céramiques","Materials Science, Ceramics","  "]
["MD92","Science des matériaux, caractérisation et mise à l'essai ","Materials Science, Characterization & Testing","  "]
["MD93","Science des matériaux, revêtements et Films","Materials Science, Coatings & Films","  "]
["MD94","Science des matériaux, Composites ","Materials Science, Composites","  "]
["MD95","Science des matériaux, multidisciplinaire ","Materials Science, Multidisciplinary","  "]
["MD96","Science des matériaux, papier et bois ","Materials Science, Paper & Wood","  "]
["MD97","Science des matériaux, Textiles ","Materials Science, Textiles","  "]
["MD98","Mathématique et informatique en Biologie","Mathematical & Computational Biology","  "]
["MD99","Mathématiques ","Mathematics","  "]
["MD100","Mathématiques appliquées ","Mathematics, Applied","  "]
["MD101","Mathématiques, Applications interdisciplinaires ","Mathematics, Interdisciplinary Applications","  "]
["MD102","Mécanique ","Mechanics","  "]
["MD103","Éthique médicale ","Medical Ethics","  "]
["MD104","Informatique médicale ","Medical Informatics","  "]
["MD105","Technologie de laboratoire médical ","Medical Laboratory Technology","  "]
["MD106","Médecine générale et interne ","Medicine, General & Internal","  "]
["MD107","Médecine légale ","Medicine, Legal","  "]
["MD108","Médecine, recherche et expérimentation ","Medicine, Research & Experimental","  "]
["MD109","Métallurgie et génie métallurgique ","Metallurgy & Metallurgical Engineering","  "]
["MD110","Météorologie et Sciences de l’atmosphère ","Meteorology & Atmospheric Sciences","  "]
["MD111","Microbiologie ","Microbiology","  "]
["MD112","Microscopie ","Microscopy","  "]
["MD113","Minéralogie ","Mineralogy","  "]
["MD114","Mines et traitement des minéraux ","Mining & Mineral Processing","  "]
["MD115","Sciences multidisciplinaires ","Multidisciplinary Sciences","  "]
["MD116","Mycologie ","Mycology","  "]
["MD117","Nanosciences et nanotechnologies ","Nanoscience & Nanotechnology","  "]
["MD118","Neuro-imagerie ","Neuroimaging","  "]
["MD119","Neurosciences ","Neurosciences","  "]
["MD120","Science nucléaire et technologie ","Nuclear Science & Technology","  "]
["MD121","Soins infirmiers ","Nursing","  "]
["MD122","Nutrition et diététique ","Nutrition & Dietetics","  "]
["MD123","Obstétrique et gynécologie ","Obstetrics & Gynecology","  "]
["MD124","Océanographie ","Oceanography","  "]
["MD125","Oncologie ","Oncology","  "]
["MD126","Recherche opérationnelle  et sciences de gestion ","Operations Research & Management Science","  "]
["MD127","Ophtalmologie ","Ophthalmology","  "]
["MD128","Optique ","Optics","  "]
["MD129","Ornithologie ","Ornithology","  "]
["MD130","Orthopédie ","Orthopedics","  "]
["MD131","Oto-rhino-laryngologie ","Otorhinolaryngology","  "]
["MD132","Paléontologie ","Paleontology","  "]
["MD133","Parasitologie ","Parasitology","  "]
["MD134","Pathologie ","Pathology","  "]
["MD135","Pédiatrie ","Pediatrics","  "]
["MD136","Pharmacologie et pharmacie ","Peripheral Vascular Disease","  "]
["MD137","Maladies vasculaires périphériques ","Pharmacology & Pharmacy","  "]
["MD138","Physique, appliquée","Physics, Applied","  "]
["MD139","Physique atomique et moléculaire et chimique ","Physics, Atomic, Molecular & Chemical","  "]
["MD140","Physique de la matière condensée ","Physics, Condensed Matter","  "]
["MD141","Physique, fluides et Plasmas ","Physics, Fluids & Plasmas","  "]
["MD142","Physique mathématique ","Physics, Mathematical","  "]
["MD143","Physique, multidisciplinaire ","Physics, Multidisciplinary","  "]
["MD144","Physique nucléaire ","Physics, Nuclear","  "]
["MD145","Physique des particules et des champs ","Physics, Particles & Fields","  "]
["MD146","Physiologie ","Physiology","  "]
["MD147","Sciences des plantes ","Plant Sciences","  "]
["MD148","Science des polymères ","Polymer Science","  "]
["MD149","Soins de santé primaires","Primary Health Care","  "]
["MD150","Psychiatrie ","Psychiatry","  "]
["MD151","Psychologie ","Psychology","  "]
["MD152","Santé publique, environnementale et du travail ","Public, Environmental & Occupational Health","  "]
["MD153","Radiologie, médecine nucléaire et l'imagerie médicale ","Radiology, Nuclear Medicine & Medical Imaging","  "]
["MD154","Réhabilitation","Rehabilitation","  "]
["MD155","Télédétection ","Remote Sensing","  "]
["MD156","Biologie de la reproduction ","Reproductive Biology","  "]
["MD157","Système respiratoire ","Respiratory System","  "]
["MD158","Rhumatologie ","Rheumatology","  "]
["MD159","Robotique ","Robotics","  "]
["MD160","Science des sols ","Soil Science","  "]
["MD161","Spectroscopie  ","Spectroscopy","  "]
["MD162","Sciences du sport ","Sport Sciences","  "]
["MD163","Statistiques et probabilités ","Statistics & Probability","  "]
["MD164","Abus de substances","Substance Abuse","  "]
["MD165","Chirurgie ","Surgery","  "]
["MD166","Télécommunications ","Telecommunications","  "]
["MD167","Thermodynamique ","Thermodynamics","  "]
["MD168","Toxicologie ","Toxicology","  "]
["MD169","Transplantation ","Transplantation","  "]
["MD170","Science du Transport et technologie ","Transportation Science & Technology","  "]
["MD171","Médecine tropicale ","Tropical Medicine","  "]
["MD172","Urologie et néphrologie ","Urology & Nephrology","  "]
["MD173","Sciences vétérinaires ","Veterinary Sciences","  "]
["MD174","Virologie ","Virology","  "]
["MD175","Ressources en eau","Water Resources","  "]
["MD176","Zoologie ","Zoology","  "]
[]
[]
[]
["Grade","Unversitaire"]
[null,"Professeur","Professeur"]
[null,"Maitre de Conférence A","MCA"]
[null,"Maitre de Conférence B","MCB"]
[null,"Maitre Assistant A","MAA"]
[null,"Maitre Assistant B","MAB"]
[null,"Doctorant","Doctorant"]
[]
[]
[null,"Dernier diplôme obtenu"]
[null,"Doctorat d'Etat"]
[null,"Doctorat"]
[null,"Magister"]
[null,"Master"]
[]
["code ","Région","Libellé établissement","Abréviation","Faculté","Département",null,null,"Université","Faculté"]
["U08E","Est","Université 20 Août 1955 de Skikda","U. Skikda","Faculté de Technologie","Département de Génie Civil",null,null,"U. Skikda","Faculté de Technologie"]
["U08E","Est","Université 20 Août 1955 de Skikda","U. Skikda","Faculté de Technologie","Département de Génie Electrique",null,null,"U. Skikda","Faculté des Lettres et des Langues"]
["U08E","Est","Université 20 Août 1955 de Skikda","U. Skikda","Faculté de Technologie","Département de Mécanique",null,null,"U. Skikda","Faculté des Sciences"]
["U08E","Est","Université 20 Août 1955 de Skikda","U. Skikda","Faculté de Technologie","Département de Pétrochimie et génie des procédés",null,null,"U. Skikda","Faculté des Sciences Economiques Commerciales et des Sciences de Gestion"]
["U08E","Est","Université 20 Août 1955 de Skikda","U. Skikda","Faculté de Technologie","Département de Technologie",null,null,"U. Skikda","Faculté des Sciences Sociales et des Sciences Humaines"]
["U08E","Est","Université 20 Août 1955 de Skikda","U. Skikda","Faculté des Lettres et des Langues","Département de Langue et Lettre Arabe",null,null,"U. Skikda","Faculté Droit et Sciences Politiques"]
["U08E","Est","Université 20 Août 1955 de Skikda","U. Skikda","Faculté des Lettres et des Langues","Département des Lettres et Langues Etrangères",null,null,"U. Guelma","Faculté de Droit et des Sciences Politiques"]
["U08E","Est","Université 20 Août 1955 de Skikda","U. Skikda","Faculté des Sciences","Département d’Informatique",null,null,"U. Guelma","Faculté des Lettres et des Langues"]
["U08E","Est","Université 20 Août 1955 de Skikda","U. Skikda","Faculté des Sciences","Département des Mathématiques",null,null,"U. Guelma","Faculté des Mathématiques et de Informatique et des Sciences de la Matière"]
["U08E","Est","Université 20 Août 1955 de Skikda","U. Skikda","Faculté des Sciences","Département des Sciences Agronomique",null,null,"U. Guelma","Faculté des Sciences de la Nature et de la Vie et des Sciences de la Terre et de l'Univers"]
["U08E","Est","Université 20 Août 1955 de Skikda","U. Skikda","Faculté des Sciences","Département des Sciences de la Matière",null,null,"U. Guelma","Faculté des Sciences Economiques Commerciales et des Sciences de Gestion"]
["U08E","Est","Université 20 Août 1955 de Skikda","U. Skikda","Faculté des Sciences","Département des Sciences de la Nature et de la Vie",null,null,"U. Guelma","Faculté des Sciences Humaines et Sociales"]
["U08E","Est","Université 20 Août 1955 de Skikda","U. Skikda","Faculté des Sciences Economiques Commerciales et des Sciences de Gestion","Département des Sciences Commerciales",null,null,"U. Guelma","Facultés des Sciences et de la Technologie"]
["U08E","Est","Université 20 Août 1955 de Skikda","U. Skikda","Faculté des Sciences Economiques Commerciales et des Sciences de Gestion","Département des Sciences de Gestion",null,null,"U. Jijel","Faculté de Droit et des Sciences Politiques"]
["U08E","Est","Université 20 Août 1955 de Skikda","U. Skikda","Faculté des Sciences Economiques Commerciales et des Sciences de Gestion","Département des Sciences Economiques",null,null,"U. Jijel","Faculté des Lettres et Langues"]
["U08E","Est","Université 20 Août 1955 de Skikda","U. Skikda","Faculté des Sciences Sociales et des Sciences Humaines","Département de Psychologie",null,null,"U. Jijel","Faculté des Sciences de la Nature et de la Vie"]
["U08E","Est","Université 20 Août 1955 de Skikda","U. Skikda","Faculté des Sciences Sociales et des Sciences Humaines","Département des Sciences Humaines",null,null,"U. Jijel","Faculté des Sciences Economiques Commerciales et des Sciences de Gestion"]
["U08E","Est","Université 20 Août 1955 de Skikda","U. Skikda","Faculté des Sciences Sociales et des Sciences Humaines","Département des Sciences Sociales",null,null,"U. Jijel","Faculté des Sciences et de la Technologie"]
["U08E","Est","Université 20 Août 1955 de Skikda","U. Skikda","Faculté Droit et Sciences Politiques","Département de Droit",null,null,"U. Jijel","Faculté des Sciences Exactes et Informatique"]
["U08E","Est","Université 20 Août 1955 de Skikda","U. Skikda","Faculté Droit et Sciences Politiques","Département des Sciences Politiques",null,null,"U. Mostaganem","Faculté de Droit et des Sciences Politiques"]
["U09E","Est","Université 8 Mai 1945 de Guelma","U. Guelma","Faculté de Droit et des Sciences Politiques","Département des Sciences Juridiques et Administratives",{"$f":"CONCATENATE(SUBSTITUTE(C255,\" \",\"_\"),SUBSTITUTE(E255,\" \",\"_\"))","v":"Université_8_Mai_1945_de_GuelmaFaculté_de_Droit_et_des_Sciences_Politiques"},"Université_8_Mai_1945_de_GuelmaFaculté_de_Droit_et_des_Sciences_Politiques","U. Mostaganem","Faculté de Médecine"]
["U09E","Est","Université 8 Mai 1945 de Guelma","U. Guelma","Faculté de Droit et des Sciences Politiques","Département des Sciences Politiques",{"$f":"CONCATENATE(SUBSTITUTE(C256,\" \",\"_\"),SUBSTITUTE(E256,\" \",\"_\"))","v":"Université_8_Mai_1945_de_GuelmaFaculté_de_Droit_et_des_Sciences_Politiques"},null,"U. Mostaganem","Faculté des Lettres et des Arts"]
["U09E","Est","Université 8 Mai 1945 de Guelma","U. Guelma","Faculté des Lettres et des Langues","Département d'Anglais","Université_8_Mai_1945_de_GuelmaFaculté_des_Lettres_et_des_Langues",null,"U. Mostaganem","Faculté des Sciences de la Nature et de la Vie"]
["U09E","Est","Université 8 Mai 1945 de Guelma","U. Guelma","Faculté des Lettres et des Langues","Département de Français","Université_8_Mai_1945_de_GuelmaFaculté_des_Lettres_et_des_Langues",null,"U. Mostaganem","Faculté des Sciences Economiques Commerciales et des Sciences de Gestion"]
["U09E","Est","Université 8 Mai 1945 de Guelma","U. Guelma","Faculté des Lettres et des Langues","Département de Littérature Arabe","Université_8_Mai_1945_de_GuelmaFaculté_des_Lettres_et_des_Langues",null,"U. Mostaganem","Faculté des Sciences et de la Technologie"]
["U09E","Est","Université 8 Mai 1945 de Guelma","U. Guelma","Faculté des Mathématiques et de Informatique et des Sciences de la Matière","Département de Mathématiques","Université_8_Mai_1945_de_GuelmaFaculté_des_Mathématiques_et_de_Informatique_et_des_Sciences_de_la_Matière",null,"U. Mostaganem","Faculté des Sciences Exactes et Informatique"]
["U09E","Est","Université 8 Mai 1945 de Guelma","U. Guelma","Faculté des Mathématiques et de Informatique et des Sciences de la Matière","Département des Sciences de la Matière","Université_8_Mai_1945_de_GuelmaFaculté_des_Mathématiques_et_de_Informatique_et_des_Sciences_de_la_Matière",null,"U. Mostaganem","Faculté des Sciences Sociales"]
["U09E","Est","Université 8 Mai 1945 de Guelma","U. Guelma","Faculté des Mathématiques et de Informatique et des Sciences de la Matière","Département d'Informatique","Université_8_Mai_1945_de_GuelmaFaculté_des_Mathématiques_et_de_Informatique_et_des_Sciences_de_la_Matière",null,"U. Mostaganem","Institut Education Physique et Sportive"]
["U09E","Est","Université 8 Mai 1945 de Guelma","U. Guelma","Faculté des Sciences de la Nature et de la Vie et des Sciences de la Terre et de Univers","Département de Biologie","Université_8_Mai_1945_de_GuelmaFaculté_des_Sciences_de_la_Nature_et_de_la_Vie_et_des_Sciences_de_la_Terre_et_de_Univers",null,"U. Bejaia","Faculté de Droit et des Sciences Politiques"]
["U09E","Est","Université 8 Mai 1945 de Guelma","U. Guelma","Faculté des Sciences de la Nature et de la Vie et des Sciences de la Terre et de Univers","Département d'Ecologie et du Génie de l'Environnement","Université_8_Mai_1945_de_GuelmaFaculté_des_Sciences_de_la_Nature_et_de_la_Vie_et_des_Sciences_de_la_Terre_et_de_Univers",null,"U. Bejaia","Faculté de Médecine"]
["U09E","Est","Université 8 Mai 1945 de Guelma","U. Guelma","Faculté des Sciences de la Nature et de la Vie et des Sciences de la Terre et de Univers","Département des Sciences de la Nature et de la Vie","Université_8_Mai_1945_de_GuelmaFaculté_des_Sciences_de_la_Nature_et_de_la_Vie_et_des_Sciences_de_la_Terre_et_de_Univers",null,"U. Bejaia","Faculté de Technologie"]
["U09E","Est","Université 8 Mai 1945 de Guelma","U. Guelma","Faculté des Sciences Economiques Commerciales et des Sciences de Gestion","Département des Sciences Commerciales","Université_8_Mai_1945_de_GuelmaFaculté_des_Sciences_Economiques_Commerciales_et_des_Sciences_de_Gestion",null,"U. Bejaia","Faculté des Lettres et des Langues"]
["U09E","Est","Université 8 Mai 1945 de Guelma","U. Guelma","Faculté des Sciences Economiques Commerciales et des Sciences de Gestion","Département des Sciences de Gestion","Université_8_Mai_1945_de_GuelmaFaculté_des_Sciences_Economiques_Commerciales_et_des_Sciences_de_Gestion",null,"U. Bejaia","Faculté des Sciences de la Nature et de la Vie"]
["U09E","Est","Université 8 Mai 1945 de Guelma","U. Guelma","Faculté des Sciences Economiques Commerciales et des Sciences de Gestion","Département des Sciences Economiques","Université_8_Mai_1945_de_GuelmaFaculté_des_Sciences_Economiques_Commerciales_et_des_Sciences_de_Gestion",null,"U. Bejaia","Faculté des Sciences Economiques Commerciales et des Sciences de Gestion"]
["U09E","Est","Université 8 Mai 1945 de Guelma","U. Guelma","Faculté des Sciences Humaines et Sociales","Département des Sciences Humaines","Université_8_Mai_1945_de_GuelmaFaculté_des_Sciences_Humaines_et_Sociales",null,"U. Bejaia","Faculté des Sciences Exactes"]
["U09E","Est","Université 8 Mai 1945 de Guelma","U. Guelma","Faculté des Sciences Humaines et Sociales","Département des Sciences Sociales","Université_8_Mai_1945_de_GuelmaFaculté_des_Sciences_Humaines_et_Sociales",null,"U. Bejaia","Faculté des Sciences Humaines et Sociales"]
["U09E","Est","Université 8 Mai 1945 de Guelma","U. Guelma","Faculté des Sciences Humaines et Sociales","Département d'Histoire et Archéologie","Université_8_Mai_1945_de_GuelmaFaculté_des_Sciences_Humaines_et_Sociales",null,"U. Tlemcen","Faculté de Médecine"]
["U09E","Est","Université 8 Mai 1945 de Guelma","U. Guelma","Facultés des Sciences et de la Technologie","Département de Génie Civil","Université_8_Mai_1945_de_GuelmaFacultés_des_Sciences_et_de_la_Technologie",null,"U. Tlemcen","Faculté de Technologie"]
["U09E","Est","Université 8 Mai 1945 de Guelma","U. Guelma","Facultés des Sciences et de la Technologie","Département de Génie des Procédés","Université_8_Mai_1945_de_GuelmaFacultés_des_Sciences_et_de_la_Technologie",null,"U. Tlemcen","Faculté des Lettres et des Langues"]
["U09E","Est","Université 8 Mai 1945 de Guelma","U. Guelma","Facultés des Sciences et de la Technologie","Département de Génie Mécanique","Université_8_Mai_1945_de_GuelmaFacultés_des_Sciences_et_de_la_Technologie",null,"U. Tlemcen","Faculté des Sciences"]
["U09E","Est","Université 8 Mai 1945 de Guelma","U. Guelma","Facultés des Sciences et de la Technologie","Département d'Electronique et de Télécommunications","Université_8_Mai_1945_de_GuelmaFacultés_des_Sciences_et_de_la_Technologie",null,"U. Tlemcen","Faculté des Sciences de la Nature et de la Vie et Sciences de la Terre et de Univers"]
["U09E","Est","Université 8 Mai 1945 de Guelma","U. Guelma","Facultés des Sciences et de la Technologie","Département d'Electrotechnique et d'Automatique","Université_8_Mai_1945_de_GuelmaFacultés_des_Sciences_et_de_la_Technologie",null,"U. Tlemcen","Faculté des Sciences Economiques Commerciales et des Sciences de Gestion"]
["U11E","Est","Université Abdelhak Benhamouda de Jijel","U. Jijel","Faculté de Droit et des Sciences Politiques","Département de Droit","Université_Abdelhak_Benhamouda_de_JijelFaculté_de_Droit_et_des_Sciences_Politiques",null,"U. Tlemcen","Faculté des Sciences Humaines et Sociales"]
["U11E","Est","Université Abdelhak Benhamouda de Jijel","U. Jijel","Faculté de Droit et des Sciences Politiques","Département des Sciences Politiques","Université_Abdelhak_Benhamouda_de_JijelFaculté_de_Droit_et_des_Sciences_Politiques",null,"U. Tlemcen","Faculté Droit et Sciences Politiques"]
["U11E","Est","Université Abdelhak Benhamouda de Jijel","U. Jijel","Faculté des Lettres et Langues","Département de Littérature Arabe","Université_Abdelhak_Benhamouda_de_JijelFaculté_des_Lettres_et_Langues",null,"U. Adrar","Faculté des Sciences et de la Technologie"]
["U11E","Est","Université Abdelhak Benhamouda de Jijel","U. Jijel","Faculté des Lettres et Langues","Département de Sociologie","Université_Abdelhak_Benhamouda_de_JijelFaculté_des_Lettres_et_Langues",null,"U. Adrar","Faculté des Sciences Sociales et Sciences Islamiques "]
["U11E","Est","Université Abdelhak Benhamouda de Jijel","U. Jijel","Faculté des Lettres et Langues","Département des Langues","Université_Abdelhak_Benhamouda_de_JijelFaculté_des_Lettres_et_Langues",null,"U. Adrar","Facultés de Droit et de Science Politique"]
["U11E","Est","Université Abdelhak Benhamouda de Jijel","U. Jijel","Faculté des Sciences de la Nature et de la Vie","Département de Chimie","Université_Abdelhak_Benhamouda_de_JijelFaculté_des_Sciences_de_la_Nature_et_de_la_Vie",null,"U. Adrar","Facultés des Lettres et des Langues"]
["U11E","Est","Université Abdelhak Benhamouda de Jijel","U. Jijel","Faculté des Sciences de la Nature et de la Vie","Département de Mathématique","Université_Abdelhak_Benhamouda_de_JijelFaculté_des_Sciences_de_la_Nature_et_de_la_Vie",null,"U. Adrar","Facultés des Sciences Economiques et Sciences Commerciales et Sciences de Gestions"]
["U11E","Est","Université Abdelhak Benhamouda de Jijel","U. Jijel","Faculté des Sciences de la Nature et de la Vie","Département de Physique","Université_Abdelhak_Benhamouda_de_JijelFaculté_des_Sciences_de_la_Nature_et_de_la_Vie",null,"U. Laghouat","Faculté de Droit et des Sciences Politiques"]
["U11E","Est","Université Abdelhak Benhamouda de Jijel","U. Jijel","Faculté des Sciences de la Nature et de la Vie","Département des Sciences de la Terre et de l’Univers","Université_Abdelhak_Benhamouda_de_JijelFaculté_des_Sciences_de_la_Nature_et_de_la_Vie",null,"U. Laghouat","Faculté de Lettres et Langues"]
["U11E","Est","Université Abdelhak Benhamouda de Jijel","U. Jijel","Faculté des Sciences de la Nature et de la Vie","Départements de Biologie Moléculaire et Cellulaire","Université_Abdelhak_Benhamouda_de_JijelFaculté_des_Sciences_de_la_Nature_et_de_la_Vie",null,"U. Laghouat","Faculté de Médecine"]
["U11E","Est","Université Abdelhak Benhamouda de Jijel","U. Jijel","Faculté des Sciences de la Nature et de la Vie","Départements de la Biologie Végétale et Animale","Université_Abdelhak_Benhamouda_de_JijelFaculté_des_Sciences_de_la_Nature_et_de_la_Vie",null,"U. Laghouat","Faculté de Technologie"]
["U11E","Est","Université Abdelhak Benhamouda de Jijel","U. Jijel","Faculté des Sciences Economiques Commerciales et des Sciences de Gestion","Département des Sciences Commerciales","Université_Abdelhak_Benhamouda_de_JijelFaculté_des_Sciences_Economiques_Commerciales_et_des_Sciences_de_Gestion",null,"U. Laghouat","Faculté des Sciences Economiques et Commerciales et Sciences de Gestion"]
["U11E","Est","Université Abdelhak Benhamouda de Jijel","U. Jijel","Faculté des Sciences Economiques Commerciales et des Sciences de Gestion","Département des Sciences de Gestion","Université_Abdelhak_Benhamouda_de_JijelFaculté_des_Sciences_Economiques_Commerciales_et_des_Sciences_de_Gestion",null,"U. Laghouat","Faculté des Sciences Humaines et Sociales"]
["U11E","Est","Université Abdelhak Benhamouda de Jijel","U. Jijel","Faculté des Sciences et de la Technologie","Département Electronique","Université_Abdelhak_Benhamouda_de_JijelFaculté_des_Sciences_et_de_la_Technologie",null,"U. Laghouat","Faculté des Sciences"]
["U11E","Est","Université Abdelhak Benhamouda de Jijel","U. Jijel","Faculté des Sciences et de la Technologie","Département Electrotechnique","Université_Abdelhak_Benhamouda_de_JijelFaculté_des_Sciences_et_de_la_Technologie",null,"U. Laghouat","Institut des Sciences et Techniques des Activités Physiques et Sportifs"]
["U11E","Est","Université Abdelhak Benhamouda de Jijel","U. Jijel","Faculté des Sciences Exactes et Informatique",null,"Université_Abdelhak_Benhamouda_de_JijelFaculté_des_Sciences_Exactes_et_Informatique",null,"U. Annaba","Faculté de Droit et des Sciences Politiques"]
["U05O","Ouest","Université Abdelhamid Ibn Badis de Mostaganem","U. Mostaganem","Faculté de Droit et des Sciences Politiques",null,"Université_Abdelhamid_Ibn_Badis_de_MostaganemFaculté_de_Droit_et_des_Sciences_Politiques",null,"U. Annaba","Faculté de Médecine"]
["U05O","Ouest","Université Abdelhamid Ibn Badis de Mostaganem","U. Mostaganem","Faculté de Médecine",null,"Université_Abdelhamid_Ibn_Badis_de_MostaganemFaculté_de_Médecine",null,"U. Annaba","Faculté des Lettres des Sciences Humaines et des Sciences Sociales"]
["U05O","Ouest","Université Abdelhamid Ibn Badis de Mostaganem","U. Mostaganem","Faculté des Lettres et des Arts","Département d’Anglais","Université_Abdelhamid_Ibn_Badis_de_MostaganemFaculté_des_Lettres_et_des_Arts",null,"U. Annaba","Faculté des Sciences"]
["U05O","Ouest","Université Abdelhamid Ibn Badis de Mostaganem","U. Mostaganem","Faculté des Lettres et des Arts","Département d’Arabe ","Université_Abdelhamid_Ibn_Badis_de_MostaganemFaculté_des_Lettres_et_des_Arts",null,"U. Annaba","Faculté des Sciences de Ingéniorat"]
["U05O","Ouest","Université Abdelhamid Ibn Badis de Mostaganem","U. Mostaganem","Faculté des Lettres et des Arts","Département d’Espagnol ","Université_Abdelhamid_Ibn_Badis_de_MostaganemFaculté_des_Lettres_et_des_Arts",null,"U. Annaba","Faculté des Sciences de la Terre"]
["U05O","Ouest","Université Abdelhamid Ibn Badis de Mostaganem","U. Mostaganem","Faculté des Lettres et des Arts","Département de Français ","Université_Abdelhamid_Ibn_Badis_de_MostaganemFaculté_des_Lettres_et_des_Arts",null,"U. Annaba","Faculté des Sciences Économiques et des Sciences de Gestion"]
["U05O","Ouest","Université Abdelhamid Ibn Badis de Mostaganem","U. Mostaganem","Faculté des Lettres et des Arts","Département des Arts ","Université_Abdelhamid_Ibn_Badis_de_MostaganemFaculté_des_Lettres_et_des_Arts",null,"U. Alger-1-","Faculté de Droit"]
["U05O","Ouest","Université Abdelhamid Ibn Badis de Mostaganem","U. Mostaganem","Faculté des Sciences de la Nature et de la Vie ","Département d’Agronomie","Université_Abdelhamid_Ibn_Badis_de_MostaganemFaculté_des_Sciences_de_la_Nature_et_de_la_Vie_",null,"U. Alger-1-","Faculté des Sciences Islamique"]
["U05O","Ouest","Université Abdelhamid Ibn Badis de Mostaganem","U. Mostaganem","Faculté des Sciences de la Nature et de la Vie ","Département d’Halieutiques","Université_Abdelhamid_Ibn_Badis_de_MostaganemFaculté_des_Sciences_de_la_Nature_et_de_la_Vie_",null,"U. Alger-1-","Faculté des Sciences Médicales"]
["U05O","Ouest","Université Abdelhamid Ibn Badis de Mostaganem","U. Mostaganem","Faculté des Sciences de la Nature et de la Vie ","Département de Biologie","Université_Abdelhamid_Ibn_Badis_de_MostaganemFaculté_des_Sciences_de_la_Nature_et_de_la_Vie_"]
["U05O","Ouest","Université Abdelhamid Ibn Badis de Mostaganem","U. Mostaganem","Faculté des Sciences de la Nature et de la Vie ","Département de Biotechnologie","Université_Abdelhamid_Ibn_Badis_de_MostaganemFaculté_des_Sciences_de_la_Nature_et_de_la_Vie_",null,"U. Alger-2- Bouzareah","Faculté des Lettres et des Langues"]
["U05O","Ouest","Université Abdelhamid Ibn Badis de Mostaganem","U. Mostaganem","Faculté des Sciences Economiques, Commerciales et des Sciences de Gestion",null,"Université_Abdelhamid_Ibn_Badis_de_MostaganemFaculté_des_Sciences_Economiques,_Commerciales_et_des_Sciences_de_Gestion",null,"U. Alger-2- Bouzareah","Faculté Sciences Humaines et Sociales"]
["U05O","Ouest","Université Abdelhamid Ibn Badis de Mostaganem","U. Mostaganem","Faculté des sciences et de la technologie","Département Génie Civil et Architecture","Université_Abdelhamid_Ibn_Badis_de_MostaganemFaculté_des_sciences_et_de_la_technologie",null,"U. Alger-2- Bouzareah","Institut d'Archéologie"]
["U05O","Ouest","Université Abdelhamid Ibn Badis de Mostaganem","U. Mostaganem","Faculté des sciences et de la technologie","Département Génie des Procèdes","Université_Abdelhamid_Ibn_Badis_de_MostaganemFaculté_des_sciences_et_de_la_technologie",null,"U. Alger-2- Bouzareah","Institut d'Interprétariat"]
["U05O","Ouest","Université Abdelhamid Ibn Badis de Mostaganem","U. Mostaganem","Faculté des sciences et de la technologie","Département Génie Electrique","Université_Abdelhamid_Ibn_Badis_de_MostaganemFaculté_des_sciences_et_de_la_technologie",null,"U. Alger-3- DelyBrahim","Faculté de Information et de la Communication"]
["U05O","Ouest","Université Abdelhamid Ibn Badis de Mostaganem","U. Mostaganem","Faculté des sciences et de la technologie","Département Génie Mécanique","Université_Abdelhamid_Ibn_Badis_de_MostaganemFaculté_des_sciences_et_de_la_technologie",null,"U. Alger-3- DelyBrahim","Faculté des Sciences Economiques Commerciales et des Sciences de Gestion"]
["U05O","Ouest","Université Abdelhamid Ibn Badis de Mostaganem","U. Mostaganem","Faculté des Sciences Exactes et Informatique",null,"Université_Abdelhamid_Ibn_Badis_de_MostaganemFaculté_des_Sciences_Exactes_et_Informatique",null,"U. Alger-3- DelyBrahim","Faculté des Sciences Politiques et Relations Internationales"]
["U05O","Ouest","Université Abdelhamid Ibn Badis de Mostaganem","U. Mostaganem","Faculté des Sciences Sociales","Département de Philosophie","Université_Abdelhamid_Ibn_Badis_de_MostaganemFaculté_des_Sciences_Sociales",null,"U. Alger-3- DelyBrahim","Institut de Education Physiques et Sportives"]
["U05O","Ouest","Université Abdelhamid Ibn Badis de Mostaganem","U. Mostaganem","Faculté des Sciences Sociales","Département de Psychologie","Université_Abdelhamid_Ibn_Badis_de_MostaganemFaculté_des_Sciences_Sociales",null,"U. Béchar","Faculté de Droit et des Sciences Politiques"]
["U05O","Ouest","Université Abdelhamid Ibn Badis de Mostaganem","U. Mostaganem","Faculté des Sciences Sociales","Département de Sociologie","Université_Abdelhamid_Ibn_Badis_de_MostaganemFaculté_des_Sciences_Sociales",null,"U. Béchar","Faculté des Lettres des Sciences Humaines et des Sciences Sociales"]
["U05O","Ouest","Université Abdelhamid Ibn Badis de Mostaganem","U. Mostaganem","Faculté des Sciences Sociales","Département des Sciences de l’Information et de Communication","Université_Abdelhamid_Ibn_Badis_de_MostaganemFaculté_des_Sciences_Sociales",null,"U. Béchar","Faculté des Sciences Economiques Commerciales et des Sciences de Gestion"]
["U05O","Ouest","Université Abdelhamid Ibn Badis de Mostaganem","U. Mostaganem","Institut d’Education Physique et Sportive","Département Activités Physiques Adaptées","Université_Abdelhamid_Ibn_Badis_de_MostaganemInstitut_d’Education_Physique_et_Sportive",null,"U. Béchar","Faculté des Sciences et Technologie"]
["U05O","Ouest","Université Abdelhamid Ibn Badis de Mostaganem","U. Mostaganem","Institut d’Education Physique et Sportive","Département d'Education Physique et Sportive","Université_Abdelhamid_Ibn_Badis_de_MostaganemInstitut_d’Education_Physique_et_Sportive",null,"U. Bordj Bou Arreridj","Faculté de Droit et des Sciences Politiques"]
["U05O","Ouest","Université Abdelhamid Ibn Badis de Mostaganem","U. Mostaganem","Institut d’Education Physique et Sportive","Département Entrainement Sportive","Université_Abdelhamid_Ibn_Badis_de_MostaganemInstitut_d’Education_Physique_et_Sportive",null,"U. Bordj Bou Arreridj","Faculté des Lettres et des Langues"]
["U07C","Centre","Université Abderrahmane Mira de Béjaia","U. Bejaia","Faculté de Droit et des Sciences Politiques","Département de  Droit  des Affaires","Université_Abderrahmane_Mira_de_BéjaiaFaculté_de_Droit_et_des_Sciences_Politiques",null,"U. Bordj Bou Arreridj","Faculté des Sciences de la Nature et de la Vie et des Sciences de la Terre et de l'Univers"]
["U07C","Centre","Université Abderrahmane Mira de Béjaia","U. Bejaia","Faculté de Droit et des Sciences Politiques","Département de Droit Privé","Université_Abderrahmane_Mira_de_BéjaiaFaculté_de_Droit_et_des_Sciences_Politiques",null,"U. Bordj Bou Arreridj","Faculté des Sciences Economiques et des Sciences Commerciales et des Sciences de Gestion"]
["U07C","Centre","Université Abderrahmane Mira de Béjaia","U. Bejaia","Faculté de Droit et des Sciences Politiques","Département de Droit Public","Université_Abderrahmane_Mira_de_BéjaiaFaculté_de_Droit_et_des_Sciences_Politiques",null,"U. Bordj Bou Arreridj","Faculté des Sciences et de la Technologie"]
["U07C","Centre","Université Abderrahmane Mira de Béjaia","U. Bejaia","Faculté de Droit et des Sciences Politiques","Département des Enseignements Classiques en Droit",{"$f":"CONCATENATE(SUBSTITUTE(C320,\" \",\"_\"),SUBSTITUTE(E320,\" \",\"_\"))","v":"Université_Abderrahmane_Mira_de_BéjaiaFaculté_de_Droit_et_des_Sciences_Politiques"},null,"U. Bordj Bou Arreridj","Faculté des Sciences Sociales et Humaines"]
["U07C","Centre","Université Abderrahmane Mira de Béjaia","U. Bejaia","Faculté de Droit et des Sciences Politiques","Département des Enseignements de Base en Droit","Université_Abderrahmane_Mira_de_BéjaiaFaculté_de_Droit_et_des_Sciences_Politiques",null,"U. Bordj Bou Arreridj","Faculté Mathématiques et Informatique"]
["U07C","Centre","Université Abderrahmane Mira de Béjaia","U. Bejaia","Faculté de Médecine","Département Médecine","Université_Abderrahmane_Mira_de_BéjaiaFaculté_de_Médecine",null,"U. Bouira","Faculté de Droit et des Sciences Politiques"]
["U07C","Centre","Université Abderrahmane Mira de Béjaia","U. Bejaia","Faculté de Médecine","Département Sciences Infirmières","Université_Abderrahmane_Mira_de_BéjaiaFaculté_de_Médecine",null,"U. Bouira","Faculté des Lettres et des Langues"]
["U07C","Centre","Université Abderrahmane Mira de Béjaia","U. Bejaia","Faculté de Technologie","Département d’Hydraulique","Université_Abderrahmane_Mira_de_BéjaiaFaculté_de_Technologie",null,"U. Bouira","Faculté des Sciences de la Nature et de la Vie et des Sciences de la Terre"]
["U07C","Centre","Université Abderrahmane Mira de Béjaia","U. Bejaia","Faculté de Technologie","Département d'Architecture","Université_Abderrahmane_Mira_de_BéjaiaFaculté_de_Technologie",null,"U. Bouira","Faculté des Sciences Economiques Commerciales et des Sciences de Gestion"]
["U07C","Centre","Université Abderrahmane Mira de Béjaia","U. Bejaia","Faculté de Technologie","Département de Génie Civil","Université_Abderrahmane_Mira_de_BéjaiaFaculté_de_Technologie",null,"U. Bouira","Faculté des Sciences et des Sciences Appliquées"]
["U07C","Centre","Université Abderrahmane Mira de Béjaia","U. Bejaia","Faculté de Technologie","Département de Génie des Procédés","Université_Abderrahmane_Mira_de_BéjaiaFaculté_de_Technologie",null,"U. Bouira","Faculté des Sciences Humaines et Sociales"]
["U07C","Centre","Université Abderrahmane Mira de Béjaia","U. Bejaia","Faculté de Technologie","Département de Génie Mécanique","Université_Abderrahmane_Mira_de_BéjaiaFaculté_de_Technologie",null,"U. Bouira","Institut des Sciences et Techniques des Activités Physiques et Sportifs"]
["U07C","Centre","Université Abderrahmane Mira de Béjaia","U. Bejaia","Faculté de Technologie","Département des Mines","Université_Abderrahmane_Mira_de_BéjaiaFaculté_de_Technologie",null,"U. Constantine-2-","Faculté de Psychologie et des Sciences de Education"]
["U07C","Centre","Université Abderrahmane Mira de Béjaia","U. Bejaia","Faculté de Technologie","Département Génie Electrique","Université_Abderrahmane_Mira_de_BéjaiaFaculté_de_Technologie",null,"U. Constantine-2-","Faculté des Nouvelles Technologies de l’Information et de la Communication"]
["U07C","Centre","Université Abderrahmane Mira de Béjaia","U. Bejaia","Faculté de Technologie","Département Technologie","Université_Abderrahmane_Mira_de_BéjaiaFaculté_de_Technologie",null,"U. Constantine-2-","Faculté des Sciences Economiques Commerciales et des Sciences de Gestion"]
["U07C","Centre","Université Abderrahmane Mira de Béjaia","U. Bejaia","Faculté des Lettres et des Langues","Département Langue et Culture Amazighes","Université_Abderrahmane_Mira_de_BéjaiaFaculté_des_Lettres_et_des_Langues",null,"U. Constantine-2-","Faculté des Sciences Humaines et des Sciences Sociales"]
["U07C","Centre","Université Abderrahmane Mira de Béjaia","U. Bejaia","Faculté des Lettres et des Langues","Département Langue et Littérature Anglaises","Université_Abderrahmane_Mira_de_BéjaiaFaculté_des_Lettres_et_des_Langues",null,"U. Constantine-2-","Institut de Bibliothéconomie"]
["U07C","Centre","Université Abderrahmane Mira de Béjaia","U. Bejaia","Faculté des Lettres et des Langues","Département Langue et Littérature Arabes","Université_Abderrahmane_Mira_de_BéjaiaFaculté_des_Lettres_et_des_Langues",null,"U. Constantine-2-","Institut des Sciences et Techniques des Activités Physiques et Sportifs"]
["U07C","Centre","Université Abderrahmane Mira de Béjaia","U. Bejaia","Faculté des Lettres et des Langues","Département Langue et Littérature Françaises","Université_Abderrahmane_Mira_de_BéjaiaFaculté_des_Lettres_et_des_Langues",null,"U. Constantine-3-","Faculté Architecture et de Construction"]
["U07C","Centre","Université Abderrahmane Mira de Béjaia","U. Bejaia","Faculté des Sciences de la Nature et de la Vie ","Département de Biologie Physico – Chimique","Université_Abderrahmane_Mira_de_BéjaiaFaculté_des_Sciences_de_la_Nature_et_de_la_Vie_",null,"U. Constantine-3-","Faculté de Médecine"]
["U07C","Centre","Université Abderrahmane Mira de Béjaia","U. Bejaia","Faculté des Sciences de la Nature et de la Vie ","Département de Microbiologie","Université_Abderrahmane_Mira_de_BéjaiaFaculté_des_Sciences_de_la_Nature_et_de_la_Vie_",null,"U. Constantine-3-","Faculté des Méthodes Pharmaceutiques Ingénierie"]
["U07C","Centre","Université Abderrahmane Mira de Béjaia","U. Bejaia","Faculté des Sciences de la Nature et de la Vie ","Département des Sciences Alimentaires","Université_Abderrahmane_Mira_de_BéjaiaFaculté_des_Sciences_de_la_Nature_et_de_la_Vie_",null,"U. Constantine-3-","Faculté des Sciences de Information et de Communication"]
["U07C","Centre","Université Abderrahmane Mira de Béjaia","U. Bejaia","Faculté des Sciences de la Nature et de la Vie ","Département des Sciences Biologiques de l’Environnement","Université_Abderrahmane_Mira_de_BéjaiaFaculté_des_Sciences_de_la_Nature_et_de_la_Vie_",null,"U. Constantine-3-","Faculté des Sciences Politiques"]
["U07C","Centre","Université Abderrahmane Mira de Béjaia","U. Bejaia","Faculté des Sciences de la Nature et de la Vie ","Département des Troncs Communs L1 et L2","Université_Abderrahmane_Mira_de_BéjaiaFaculté_des_Sciences_de_la_Nature_et_de_la_Vie_",null,"U. Ghardaia","Faculté de Droit et des Sciences Politiques"]
["U07C","Centre","Université Abderrahmane Mira de Béjaia","U. Bejaia","Faculté des Sciences Economiques, Commerciales et des Sciences de Gestion","Département de la Formation Initiale","Université_Abderrahmane_Mira_de_BéjaiaFaculté_des_Sciences_Economiques,_Commerciales_et_des_Sciences_de_Gestion",null,"U. Ghardaia","Faculté des Lettres et des Langues"]
["U07C","Centre","Université Abderrahmane Mira de Béjaia","U. Bejaia","Faculté des Sciences Economiques, Commerciales et des Sciences de Gestion","Département des Sciences Commerciales","Université_Abderrahmane_Mira_de_BéjaiaFaculté_des_Sciences_Economiques,_Commerciales_et_des_Sciences_de_Gestion",null,"U. Ghardaia","Faculté des Sciences de la Nature et de la Vie et des Sciences de la Terre"]
["U07C","Centre","Université Abderrahmane Mira de Béjaia","U. Bejaia","Faculté des Sciences Economiques, Commerciales et des Sciences de Gestion","Département des Sciences de Gestion","Université_Abderrahmane_Mira_de_BéjaiaFaculté_des_Sciences_Economiques,_Commerciales_et_des_Sciences_de_Gestion",null,"U. Ghardaia","Faculté des Sciences Economiques Commerciales et des Sciences de Gestion"]
["U07C","Centre","Université Abderrahmane Mira de Béjaia","U. Bejaia","Faculté des Sciences Economiques, Commerciales et des Sciences de Gestion","Département des Sciences Economiques","Université_Abderrahmane_Mira_de_BéjaiaFaculté_des_Sciences_Economiques,_Commerciales_et_des_Sciences_de_Gestion",null,"U. Ghardaia","Faculté des Sciences et de la Technologie"]
["U07C","Centre","Université Abderrahmane Mira de Béjaia","U. Bejaia","Faculté des Sciences Exactes","Département Chimie","Université_Abderrahmane_Mira_de_BéjaiaFaculté_des_Sciences_Exactes",null,"U. Khemis Miliana","Faculté de Droit et des Sciences Politiques"]
["U07C","Centre","Université Abderrahmane Mira de Béjaia","U. Bejaia","Faculté des Sciences Exactes","Département Informatique","Université_Abderrahmane_Mira_de_BéjaiaFaculté_des_Sciences_Exactes",null,"U. Khemis Miliana","Faculté des Lettres et des Langues"]
["U07C","Centre","Université Abderrahmane Mira de Béjaia","U. Bejaia","Faculté des Sciences Exactes","Département Mathématiques","Université_Abderrahmane_Mira_de_BéjaiaFaculté_des_Sciences_Exactes",null,"U. Khemis Miliana","Faculté des Sciences de la Nature et de la Vie et des Sciences de la Terre"]
["U07C","Centre","Université Abderrahmane Mira de Béjaia","U. Bejaia","Faculté des Sciences Exactes","Département Physique","Université_Abderrahmane_Mira_de_BéjaiaFaculté_des_Sciences_Exactes",null,"U. Khemis Miliana","Faculté des Sciences Economiques Commerciales et des Sciences de Gestion"]
["U07C","Centre","Université Abderrahmane Mira de Béjaia","U. Bejaia","Faculté des Sciences Exactes","Département Recherche Opérationnelle","Université_Abderrahmane_Mira_de_BéjaiaFaculté_des_Sciences_Exactes",null,"U. Khemis Miliana","Faculté des Sciences et de la Technologie"]
["U07C","Centre","Université Abderrahmane Mira de Béjaia","U. Bejaia","Faculté des Sciences Humaines et Sociales","Département des Sciences et Techniques des Activités Physiques et Sportives","Université_Abderrahmane_Mira_de_BéjaiaFaculté_des_Sciences_Humaines_et_Sociales",null,"U. Khemis Miliana","Faculté des Sciences Sociales et Humaines"]
["U07C","Centre","Université Abderrahmane Mira de Béjaia","U. Bejaia","Faculté des Sciences Humaines et Sociales","Département des Sciences Humaines","Université_Abderrahmane_Mira_de_BéjaiaFaculté_des_Sciences_Humaines_et_Sociales",null,"U. Khemis Miliana","Institut des Sciences et Techniques des Activités Physiques et Sportifs"]
["U07C","Centre","Université Abderrahmane Mira de Béjaia","U. Bejaia","Faculté des Sciences Humaines et Sociales","Département des Sciences Sociales","Université_Abderrahmane_Mira_de_BéjaiaFaculté_des_Sciences_Humaines_et_Sociales",null,"U. Khenchela","Faculté de Droit et des Sciences Politiques"]
["U03O","Ouest","Université Aboubeker Belkaid de Tlemcen","U. Tlemcen","Faculté de Médecine","Départements de Médecine","Université_Aboubeker_Belkaid_de_TlemcenFaculté_de_Médecine",null,"U. Khenchela","Faculté des Lettres et Langues"]
["U03O","Ouest","Université Aboubeker Belkaid de Tlemcen","U. Tlemcen","Faculté de Médecine","Départements de Médecine Dentaire","Université_Aboubeker_Belkaid_de_TlemcenFaculté_de_Médecine",null,"U. Khenchela","Faculté des Sciences de la Nature et de la Vie"]
["U03O","Ouest","Université Aboubeker Belkaid de Tlemcen","U. Tlemcen","Faculté de Médecine","Départements de Pharmacie","Université_Aboubeker_Belkaid_de_TlemcenFaculté_de_Médecine",null,"U. Khenchela","Faculté des Sciences Economiques Commerciales et des Sciences de Gestion"]
["U03O","Ouest","Université Aboubeker Belkaid de Tlemcen","U. Tlemcen","Faculté de Technologie","Département d'Architecture","Université_Aboubeker_Belkaid_de_TlemcenFaculté_de_Technologie",null,"U. Khenchela","Faculté des Sciences et de la Technologie"]
["U03O","Ouest","Université Aboubeker Belkaid de Tlemcen","U. Tlemcen","Faculté de Technologie","Département de Génie Civil","Université_Aboubeker_Belkaid_de_TlemcenFaculté_de_Technologie",null,"U. Khenchela","Faculté des Sciences Sociales et Humaines"]
["U03O","Ouest","Université Aboubeker Belkaid de Tlemcen","U. Tlemcen","Faculté de Technologie","Département de Génie Electrique et Electronique","Université_Aboubeker_Belkaid_de_TlemcenFaculté_de_Technologie",null,"U. Mascara","Faculté des Droits et des Sciences Politiques"]
["U03O","Ouest","Université Aboubeker Belkaid de Tlemcen","U. Tlemcen","Faculté de Technologie","Département de Génie Mécanique","Université_Aboubeker_Belkaid_de_TlemcenFaculté_de_Technologie",null,"U. Mascara","Faculté des Lettres et des Langues"]
["U03O","Ouest","Université Aboubeker Belkaid de Tlemcen","U. Tlemcen","Faculté de Technologie","Département des Sciences et Techniques","Université_Aboubeker_Belkaid_de_TlemcenFaculté_de_Technologie",null,"U. Mascara","Faculté des Sciences de la Nature et de la Vie"]
["U03O","Ouest","Université Aboubeker Belkaid de Tlemcen","U. Tlemcen","Faculté de Technologie","Département d'Hydraulique","Université_Aboubeker_Belkaid_de_TlemcenFaculté_de_Technologie",null,"U. Mascara","Faculté des Sciences Economiques Commerciales et des Sciences de Gestion"]
["U03O","Ouest","Université Aboubeker Belkaid de Tlemcen","U. Tlemcen","Faculté des Lettres et des Langues","Département de langue et littérature arabes ","Université_Aboubeker_Belkaid_de_TlemcenFaculté_des_Lettres_et_des_Langues",null,"U. Mascara","Faculté des Sciences et de la Technologie"]
["U03O","Ouest","Université Aboubeker Belkaid de Tlemcen","U. Tlemcen","Faculté des Lettres et des Langues","Département des Arts ","Université_Aboubeker_Belkaid_de_TlemcenFaculté_des_Lettres_et_des_Langues",null,"U. Mascara","Faculté des Sciences Humaines et Sociales"]
["U03O","Ouest","Université Aboubeker Belkaid de Tlemcen","U. Tlemcen","Faculté des Lettres et des Langues","Département des langues et Littératures Etrangères","Université_Aboubeker_Belkaid_de_TlemcenFaculté_des_Lettres_et_des_Langues",null,"U. M'sila","Faculté de Droit et des Sciences Politiques"]
["U03O","Ouest","Université Aboubeker Belkaid de Tlemcen","U. Tlemcen","Faculté des Sciences","Département de Chimie","Université_Aboubeker_Belkaid_de_TlemcenFaculté_des_Sciences",null,"U. M'sila","Faculté de Technologie"]
["U03O","Ouest","Université Aboubeker Belkaid de Tlemcen","U. Tlemcen","Faculté des Sciences","Département de Maths","Université_Aboubeker_Belkaid_de_TlemcenFaculté_des_Sciences",null,"U. M'sila","Faculté des Lettres et des Langues"]
["U03O","Ouest","Université Aboubeker Belkaid de Tlemcen","U. Tlemcen","Faculté des Sciences","Département de Physique","Université_Aboubeker_Belkaid_de_TlemcenFaculté_des_Sciences",null,"U. M'sila","Faculté des Mathématiques et de Informatique"]
["U03O","Ouest","Université Aboubeker Belkaid de Tlemcen","U. Tlemcen","Faculté des Sciences","Département d'Informatique","Université_Aboubeker_Belkaid_de_TlemcenFaculté_des_Sciences",null,"U. M'sila","Faculté des Sciences"]
["U03O","Ouest","Université Aboubeker Belkaid de Tlemcen","U. Tlemcen","Faculté des Sciences de la Nature et de la Vie et Sciences de la Terre et de l’Univers","Département Agro-Foresterie","Université_Aboubeker_Belkaid_de_TlemcenFaculté_des_Sciences_de_la_Nature_et_de_la_Vie_et_Sciences_de_la_Terre_et_de_l’Univers",null,"U. M'sila","Faculté des Sciences Economiques Commerciales et des Sciences de Gestion"]
["U03O","Ouest","Université Aboubeker Belkaid de Tlemcen","U. Tlemcen","Faculté des Sciences de la Nature et de la Vie et Sciences de la Terre et de l’Univers","Département Biologie","Université_Aboubeker_Belkaid_de_TlemcenFaculté_des_Sciences_de_la_Nature_et_de_la_Vie_et_Sciences_de_la_Terre_et_de_l’Univers",null,"U. M'sila","Faculté des Sciences Humaines et des Sciences Sociales"]
["U03O","Ouest","Université Aboubeker Belkaid de Tlemcen","U. Tlemcen","Faculté des Sciences de la Nature et de la Vie et Sciences de la Terre et de l’Univers","Département Ecologie et Environnement","Université_Aboubeker_Belkaid_de_TlemcenFaculté_des_Sciences_de_la_Nature_et_de_la_Vie_et_Sciences_de_la_Terre_et_de_l’Univers",null,"U. Sétif-2-","Faculté de Droit et des Sciences Politiques"]
["U03O","Ouest","Université Aboubeker Belkaid de Tlemcen","U. Tlemcen","Faculté des Sciences Economiques, Commerciales et des Sciences de Gestion","Département Sciences Commerciales","Université_Aboubeker_Belkaid_de_TlemcenFaculté_des_Sciences_Economiques,_Commerciales_et_des_Sciences_de_Gestion",null,"U. Sétif-2-","Faculté des Lettres et des Langues"]
["U03O","Ouest","Université Aboubeker Belkaid de Tlemcen","U. Tlemcen","Faculté des Sciences Economiques, Commerciales et des Sciences de Gestion","Département Sciences de Gestion","Université_Aboubeker_Belkaid_de_TlemcenFaculté_des_Sciences_Economiques,_Commerciales_et_des_Sciences_de_Gestion",null,"U. Sétif-2-","Faculté des Sciences Sociales et Humaines"]
["U03O","Ouest","Université Aboubeker Belkaid de Tlemcen","U. Tlemcen","Faculté des Sciences Economiques, Commerciales et des Sciences de Gestion","Département Sciences Économiques","Université_Aboubeker_Belkaid_de_TlemcenFaculté_des_Sciences_Economiques,_Commerciales_et_des_Sciences_de_Gestion",null,"U. Souk Ahras","Faculté de Droit et des Sciences Politiques"]
["U03O","Ouest","Université Aboubeker Belkaid de Tlemcen","U. Tlemcen","Faculté des Sciences Humaines et Sociales","Département des Sciences Humaines","Université_Aboubeker_Belkaid_de_TlemcenFaculté_des_Sciences_Humaines_et_Sociales",null,"U. Souk Ahras","Faculté des Lettres et Langues"]
["U03O","Ouest","Université Aboubeker Belkaid de Tlemcen","U. Tlemcen","Faculté des Sciences Humaines et Sociales","Département des Sciences Sociales","Université_Aboubeker_Belkaid_de_TlemcenFaculté_des_Sciences_Humaines_et_Sociales",null,"U. Souk Ahras","Faculté des Sciences de la Nature et de la Vie"]
["U03O","Ouest","Université Aboubeker Belkaid de Tlemcen","U. Tlemcen","Faculté des Sciences Humaines et Sociales","Département Histoire et Archéologie","Université_Aboubeker_Belkaid_de_TlemcenFaculté_des_Sciences_Humaines_et_Sociales",null,"U. Souk Ahras","Faculté des Sciences Economiques et Commerciales et Sciences de Gestion"]
["U03O","Ouest","Université Aboubeker Belkaid de Tlemcen","U. Tlemcen","Faculté Droit et Sciences Politiques","Département de Droit","Université_Aboubeker_Belkaid_de_TlemcenFaculté_Droit_et_Sciences_Politiques",null,"U. Souk Ahras","Faculté des Sciences et Technologie"]
["U03O","Ouest","Université Aboubeker Belkaid de Tlemcen","U. Tlemcen","Faculté Droit et Sciences Politiques","Département des Sciences Politiques","Université_Aboubeker_Belkaid_de_TlemcenFaculté_Droit_et_Sciences_Politiques",null,"U. Souk Ahras","Faculté des Sciences Sociales et Humaines"]
["U06O","Ouest","Université Africaine Ahmed Draya Adrar","U. Adrar","Faculté des Sciences et de la Technologie","Département des Mathématiques et Informatique","Université_Africaine_Ahmed_Draya_AdrarFaculté_des_Sciences_et_de_la_Technologie",null,"U. Souk Ahras","Institut Education Physique et Sportive"]
["U06O","Ouest","Université Africaine Ahmed Draya Adrar","U. Adrar","Faculté des Sciences et de la Technologie","Département des Sciences de la Matière","Université_Africaine_Ahmed_Draya_AdrarFaculté_des_Sciences_et_de_la_Technologie",null,"U. Souk Ahras","Institut des Sciences Agronomiques et Vétérinaires"]
["U06O","Ouest","Université Africaine Ahmed Draya Adrar","U. Adrar","Faculté des Sciences et de la Technologie","Département des Sciences de la Nature et de la Vie","Université_Africaine_Ahmed_Draya_AdrarFaculté_des_Sciences_et_de_la_Technologie",null,"U. El Oued","Faculté de Droit et des Sciences Politiques"]
["U06O","Ouest","Université Africaine Ahmed Draya Adrar","U. Adrar","Faculté des Sciences et de la Technologie","Département des Sciences de la Technologie","Université_Africaine_Ahmed_Draya_AdrarFaculté_des_Sciences_et_de_la_Technologie",null,"U. El Oued","Faculté des Lettres et des Langues"]
["U06O","Ouest","Université Africaine Ahmed Draya Adrar","U. Adrar","Faculté des Sciences et de la Technologie","Département Hydrocarbures et Energies Renouvelables",{"$f":"CONCATENATE(SUBSTITUTE(C384,\" \",\"_\"),SUBSTITUTE(E384,\" \",\"_\"))","v":"Université_Africaine_Ahmed_Draya_AdrarFaculté_des_Sciences_et_de_la_Technologie"},null,"U. El Oued","Faculté des Sciences de la Nature et de la Vie"]
["U06O","Ouest","Université Africaine Ahmed Draya Adrar","U. Adrar","Faculté des Sciences, Sociales et Sciences Islamiques  ",null,"Université_Africaine_Ahmed_Draya_AdrarFaculté_des_Sciences,_Sociales_et_Sciences_Islamiques__",null,"U. El Oued","Faculté des Sciences Economiques et Commerciales et Sciences de Gestion"]
["U06O","Ouest","Université Africaine Ahmed Draya Adrar","U. Adrar","Facultés de Droit et de Science Politique",null,"Université_Africaine_Ahmed_Draya_AdrarFacultés_de_Droit_et_de_Science_Politique",null,"U. El Oued","Faculté des Sciences et Technologie"]
["U06O","Ouest","Université Africaine Ahmed Draya Adrar","U. Adrar","Facultés des Lettres et des Langues",null,"Université_Africaine_Ahmed_Draya_AdrarFacultés_des_Lettres_et_des_Langues",null,"U. El Oued","Faculté des Sciences Sociales et Humaines"]
["U06O","Ouest","Université Africaine Ahmed Draya Adrar","U. Adrar","Facultés des Sciences Economiques et Sciences Commerciales et Sciences de Gestions",null,"Université_Africaine_Ahmed_Draya_AdrarFacultés_des_Sciences_Economiques_et_Sciences_Commerciales_et_Sciences_de_Gestions",null,"U. Tarf","Faculté de Droit et des Sciences Politiques"]
["U09C","Centre","Université Amar Telidji de Laghouat","U. Laghouat","Faculté de Droit et des Sciences Politiques","Département de Droit","Université_Amar_Telidji_de_LaghouatFaculté_de_Droit_et_des_Sciences_Politiques",null,"U. Tarf","Faculté des Lettres et des Langues"]
["U09C","Centre","Université Amar Telidji de Laghouat","U. Laghouat","Faculté de Droit et des Sciences Politiques","Département de Sciences Politiques","Université_Amar_Telidji_de_LaghouatFaculté_de_Droit_et_des_Sciences_Politiques",null,"U. Tarf","Faculté des Sciences de la Nature et de la Vie"]
["U09C","Centre","Université Amar Telidji de Laghouat","U. Laghouat","Faculté de Lettres et Langues","Département de Langue et Littérature Anglaises","Université_Amar_Telidji_de_LaghouatFaculté_de_Lettres_et_Langues","Université_Amar_Telidji_de_LaghouatFaculté_de_Lettres_et_Langues","U. Tarf","Faculté des Sciences Economiques et des Sciences Commerciales et des Sciences de Gestion"]
["U09C","Centre","Université Amar Telidji de Laghouat","U. Laghouat","Faculté de Lettres et Langues","Département de Langue et Littérature Arabe","Université_Amar_Telidji_de_LaghouatFaculté_de_Lettres_et_Langues",null,"U. Tarf","Faculté des Sciences et Technologie"]
["U09C","Centre","Université Amar Telidji de Laghouat","U. Laghouat","Faculté de Lettres et Langues","Département de Langue et Littérature Françaises","Université_Amar_Telidji_de_LaghouatFaculté_de_Lettres_et_Langues",null,"U. Tarf","Faculté des Sciences Sociales et Humaines"]
["U09C","Centre","Université Amar Telidji de Laghouat","U. Laghouat","Faculté de Médecine",null,"Université_Amar_Telidji_de_LaghouatFaculté_de_Médecine",null,"U. STHB","Faculté Electronique et Informatique"]
["U09C","Centre","Université Amar Telidji de Laghouat","U. Laghouat","Faculté de Technologie","Département d’Architecture","Université_Amar_Telidji_de_LaghouatFaculté_de_Technologie",null,"U. STHB","Faculté de Chimie"]
["U09C","Centre","Université Amar Telidji de Laghouat","U. Laghouat","Faculté de Technologie","Département d’Electronique","Université_Amar_Telidji_de_LaghouatFaculté_de_Technologie",null,"U. STHB","Faculté de Génie Civil"]
["U09C","Centre","Université Amar Telidji de Laghouat","U. Laghouat","Faculté de Technologie","Département d’Electrotechnique","Université_Amar_Telidji_de_LaghouatFaculté_de_Technologie",null,"U. STHB","Faculté de Génie Mécanique et Génie des Procédés"]
["U09C","Centre","Université Amar Telidji de Laghouat","U. Laghouat","Faculté de Technologie","Département de Génie Civil","Université_Amar_Telidji_de_LaghouatFaculté_de_Technologie",null,"U. STHB","Faculté de Mathématique"]
["U09C","Centre","Université Amar Telidji de Laghouat","U. Laghouat","Faculté de Technologie","Département de Génie des Procédés","Université_Amar_Telidji_de_LaghouatFaculté_de_Technologie",null,"U. STHB","Faculté de Physique"]
["U09C","Centre","Université Amar Telidji de Laghouat","U. Laghouat","Faculté de Technologie","Département de Génie Mécanique","Université_Amar_Telidji_de_LaghouatFaculté_de_Technologie",null,"U. STHB","Faculté des Sciences Biologiques"]
["U09C","Centre","Université Amar Telidji de Laghouat","U. Laghouat","Faculté de Technologie","Département des Sciences et Techniques","Université_Amar_Telidji_de_LaghouatFaculté_de_Technologie",null,"U. STHB","Faculté des Sciences de la Terre de Géographie et de Aménagement du Territoire"]
["U09C","Centre","Université Amar Telidji de Laghouat","U. Laghouat","Faculté des Sciences Economiques et Commerciales et Sciences de Gestion","Département des Sciences Commerciales","Université_Amar_Telidji_de_LaghouatFaculté_des_Sciences_Economiques_et_Commerciales_et_Sciences_de_Gestion",null,"U. STO","Faculté Architecture et de Génie Civil"]
["U09C","Centre","Université Amar Telidji de Laghouat","U. Laghouat","Faculté des Sciences Economiques et Commerciales et Sciences de Gestion","Département des Sciences de Gestion","Université_Amar_Telidji_de_LaghouatFaculté_des_Sciences_Economiques_et_Commerciales_et_Sciences_de_Gestion",null,"U. STO","Faculté de Chimie"]
["U09C","Centre","Université Amar Telidji de Laghouat","U. Laghouat","Faculté des Sciences Economiques et Commerciales et Sciences de Gestion","Département des Sciences Economiques","Université_Amar_Telidji_de_LaghouatFaculté_des_Sciences_Economiques_et_Commerciales_et_Sciences_de_Gestion",null,"U. STO","Faculté de Génie Mécanique"]
["U09C","Centre","Université Amar Telidji de Laghouat","U. Laghouat","Faculté des Sciences Humaines et Sociales","Département de Sciences Sociales","Université_Amar_Telidji_de_LaghouatFaculté_des_Sciences_Humaines_et_Sociales",null,"U. STO","Faculté de Physique"]
["U09C","Centre","Université Amar Telidji de Laghouat","U. Laghouat","Faculté des Sciences Humaines et Sociales","Département des Sciences Islamiques","Université_Amar_Telidji_de_LaghouatFaculté_des_Sciences_Humaines_et_Sociales",null,"U. STO","Faculté des Mathématiques et de Informatique"]
["U09C","Centre","Université Amar Telidji de Laghouat","U. Laghouat","Faculté des Sciences Humaines et Sociales","Département Sciences Humaines","Université_Amar_Telidji_de_LaghouatFaculté_des_Sciences_Humaines_et_Sociales",null,"U. STO","Faculté des Sciences de la Nature et de la Vie"]
["U09C","Centre","Université Amar Telidji de Laghouat","U. Laghouat","Faculté des sciences ","Département de Biologie","Université_Amar_Telidji_de_LaghouatFaculté_des_sciences ",null,"U. STO","Faculté Génie Electrique"]
["U09C","Centre","Université Amar Telidji de Laghouat","U. Laghouat","Faculté des sciences ","Département des Mathématiques et de l'Informatique","Université_Amar_Telidji_de_LaghouatFaculté_des_sciences ",null,"U. STO","Institut de Sport"]
["U09C","Centre","Université Amar Telidji de Laghouat","U. Laghouat","Faculté des sciences ","Département des Sciences Agronomiques","Université_Amar_Telidji_de_LaghouatFaculté_des_sciences ",null,"U. Sc. Islamiques Constantine","Faculté de Charia et de Economie "]
["U09C","Centre","Université Amar Telidji de Laghouat","U. Laghouat","Faculté des sciences ","Département des Sciences de la Matière","Université_Amar_Telidji_de_LaghouatFaculté_des_sciences ",null,"U. Sc. Islamiques Constantine","Faculté de Fondement de Religion "]
["U09C","Centre","Université Amar Telidji de Laghouat","U. Laghouat","Institut des Sciences et Techniques des Activités Physiques et Sportifs",null,"Université_Amar_Telidji_de_LaghouatInstitut_des_Sciences_et_Techniques_des_Activités_Physiques_et_Sportifs",null,"U. Sc. Islamiques Constantine","Faculté des Arts et de la Civilisation Islamique"]
["U02E","Est","Université Badji Mokhtar Annaba","U. Annaba","Faculté de Droit et des Sciences Politiques","Département de Droit","Université_Badji_Mokhtar_AnnabaFaculté_de_Droit_et_des_Sciences_Politiques",null,"U. Sidi Bel Abbès","Faculté de Médecine"]
["U02E","Est","Université Badji Mokhtar Annaba","U. Annaba","Faculté de Droit et des Sciences Politiques","Département des Sciences Politiques","Université_Badji_Mokhtar_AnnabaFaculté_de_Droit_et_des_Sciences_Politiques",null,"U. Sidi Bel Abbès","Faculté de Technologie"]
["U02E","Est","Université Badji Mokhtar Annaba","U. Annaba","Faculté de Médecine","Département de Chirurgie Dentaire","Université_Badji_Mokhtar_AnnabaFaculté_de_Médecine",null,"U. Sidi Bel Abbès","Faculté des Lettres et des Sciences Humaines"]
["U02E","Est","Université Badji Mokhtar Annaba","U. Annaba","Faculté de Médecine","Département de Médecine","Université_Badji_Mokhtar_AnnabaFaculté_de_Médecine",null,"U. Sidi Bel Abbès","Faculté des Sciences"]
["U02E","Est","Université Badji Mokhtar Annaba","U. Annaba","Faculté de Médecine","Département de Pharmacie","Université_Badji_Mokhtar_AnnabaFaculté_de_Médecine",null,"U. Sidi Bel Abbès","Faculté des Sciences Commerciales"]
["U02E","Est","Université Badji Mokhtar Annaba","U. Annaba","Faculté des Lettres, des Sciences Humaines et des Sciences Sociales","Département d'Anglais","Université_Badji_Mokhtar_AnnabaFaculté_des_Lettres,_des_Sciences_Humaines_et_des_Sciences_Sociales",null,"U. Sidi Bel Abbès","Faculté de Droit et de Science Politique"]
["U02E","Est","Université Badji Mokhtar Annaba","U. Annaba","Faculté des Lettres, des Sciences Humaines et des Sciences Sociales","Département de Langue et Littérature Arabe","Université_Badji_Mokhtar_AnnabaFaculté_des_Lettres,_des_Sciences_Humaines_et_des_Sciences_Sociales",null,"U. Batna","Faculté de Droit et des Sciences Politiques"]
["U02E","Est","Université Badji Mokhtar Annaba","U. Annaba","Faculté des Lettres, des Sciences Humaines et des Sciences Sociales","Département de Langue Italienne","Université_Badji_Mokhtar_AnnabaFaculté_des_Lettres,_des_Sciences_Humaines_et_des_Sciences_Sociales",null,"U. Batna","Faculté de Lettres et Langues"]
["U02E","Est","Université Badji Mokhtar Annaba","U. Annaba","Faculté des Lettres, des Sciences Humaines et des Sciences Sociales","Département de l'Éducation Physique et des Sports","Université_Badji_Mokhtar_AnnabaFaculté_des_Lettres,_des_Sciences_Humaines_et_des_Sciences_Sociales",null,"U. Batna","Faculté de Médecine"]
["U02E","Est","Université Badji Mokhtar Annaba","U. Annaba","Faculté des Lettres, des Sciences Humaines et des Sciences Sociales","Département de Philosophie","Université_Badji_Mokhtar_AnnabaFaculté_des_Lettres,_des_Sciences_Humaines_et_des_Sciences_Sociales",null,"U. Batna","Faculté de Technologie"]
["U02E","Est","Université Badji Mokhtar Annaba","U. Annaba","Faculté des Lettres, des Sciences Humaines et des Sciences Sociales","Département de Psychologie","Université_Badji_Mokhtar_AnnabaFaculté_des_Lettres,_des_Sciences_Humaines_et_des_Sciences_Sociales",null,"U. Batna","Faculté des Sciences"]
["U02E","Est","Université Badji Mokhtar Annaba","U. Annaba","Faculté des Lettres, des Sciences Humaines et des Sciences Sociales","Département de Sociologie","Université_Badji_Mokhtar_AnnabaFaculté_des_Lettres,_des_Sciences_Humaines_et_des_Sciences_Sociales",null,"U. Batna","Faculté des Sciences Économiques et Sciences de Gestion"]
["U02E","Est","Université Badji Mokhtar Annaba","U. Annaba","Faculté des Lettres, des Sciences Humaines et des Sciences Sociales","Département de Traduction","Université_Badji_Mokhtar_AnnabaFaculté_des_Lettres,_des_Sciences_Humaines_et_des_Sciences_Sociales",null,"U. Batna","Faculté des Sciences Humaines Sciences Sociales Sciences Islamiques"]
["U02E","Est","Université Badji Mokhtar Annaba","U. Annaba","Faculté des Lettres, des Sciences Humaines et des Sciences Sociales","Département d'Economie Bibliothèques","Université_Badji_Mokhtar_AnnabaFaculté_des_Lettres,_des_Sciences_Humaines_et_des_Sciences_Sociales",null,"U. Batna","Institut de Génie Civil hydraulique et Architecture"]
["U02E","Est","Université Badji Mokhtar Annaba","U. Annaba","Faculté des Lettres, des Sciences Humaines et des Sciences Sociales","Département des Sciences de la Communication","Université_Badji_Mokhtar_AnnabaFaculté_des_Lettres,_des_Sciences_Humaines_et_des_Sciences_Sociales",null,"U. Batna","Institut des Sciences et Techniques des Activités Physiques et Sportifs"]
["U02E","Est","Université Badji Mokhtar Annaba","U. Annaba","Faculté des Lettres, des Sciences Humaines et des Sciences Sociales","Département des Sciences Humaines et Sociales","Université_Badji_Mokhtar_AnnabaFaculté_des_Lettres,_des_Sciences_Humaines_et_des_Sciences_Sociales",null,"U. Batna","Institut des Sciences Vétérinaires et des Sciences Agronomiques"]
["U02E","Est","Université Badji Mokhtar Annaba","U. Annaba","Faculté des Lettres, des Sciences Humaines et des Sciences Sociales","Département d'Histoire","Université_Badji_Mokhtar_AnnabaFaculté_des_Lettres,_des_Sciences_Humaines_et_des_Sciences_Sociales",null,"U. Batna","Institut Hygiène et Sécurité Industrielle"]
["U02E","Est","Université Badji Mokhtar Annaba","U. Annaba","Faculté des Lettres, des Sciences Humaines et des Sciences Sociales","Département Français","Université_Badji_Mokhtar_AnnabaFaculté_des_Lettres,_des_Sciences_Humaines_et_des_Sciences_Sociales",null,"U. Oran","Faculté de Droit"]
["U02E","Est","Université Badji Mokhtar Annaba","U. Annaba","Faculté des Sciences","Département de Biochimie","Université_Badji_Mokhtar_AnnabaFaculté_des_Sciences",null,"U. Oran","Faculté de Médecine"]
["U02E","Est","Université Badji Mokhtar Annaba","U. Annaba","Faculté des Sciences","Département de Biologie","Université_Badji_Mokhtar_AnnabaFaculté_des_Sciences",null,"U. Oran","Faculté des Lettres et des Langues"]
["U02E","Est","Université Badji Mokhtar Annaba","U. Annaba","Faculté des Sciences","Département de Chimie","Université_Badji_Mokhtar_AnnabaFaculté_des_Sciences",null,"U. Oran","Faculté des Sciences de la Nature et de la Vie"]
["U02E","Est","Université Badji Mokhtar Annaba","U. Annaba","Faculté des Sciences","Département de Mathématiques","Université_Badji_Mokhtar_AnnabaFaculté_des_Sciences",null,"U. Oran","Faculté des Sciences de la Terre de la Géographie et de Aménagement du Territoire"]
["U02E","Est","Université Badji Mokhtar Annaba","U. Annaba","Faculté des Sciences","Département de Mathématiques-Informatique","Université_Badji_Mokhtar_AnnabaFaculté_des_Sciences",null,"U. Oran","Faculté des Sciences Economiques Commerciales et des Sciences de Gestion"]
["U02E","Est","Université Badji Mokhtar Annaba","U. Annaba","Faculté des Sciences","Département de Physique","Université_Badji_Mokhtar_AnnabaFaculté_des_Sciences",null,"U. Oran","Faculté des Sciences Exacte et Appliqué"]
["U02E","Est","Université Badji Mokhtar Annaba","U. Annaba","Faculté des Sciences","Département des Sciences de la Matière","Université_Badji_Mokhtar_AnnabaFaculté_des_Sciences",null,"U. Oran","Faculté des Sciences Humaines et de la Civilisation Islamique"]
["U02E","Est","Université Badji Mokhtar Annaba","U. Annaba","Faculté des Sciences","Département des Sciences de la Mer","Université_Badji_Mokhtar_AnnabaFaculté_des_Sciences",null,"U. Oran","Faculté des Sciences Sociales"]
["U02E","Est","Université Badji Mokhtar Annaba","U. Annaba","Faculté des Sciences","Département des Sciences de la Nature et de la Vie","Université_Badji_Mokhtar_AnnabaFaculté_des_Sciences",null,"U. Sétif-1-","Faculté Architecture et des Sciences de la Terre"]
["U02E","Est","Université Badji Mokhtar Annaba","U. Annaba","Faculté des Sciences de l’Ingéniorat","Département d’Electromécanique","Université_Badji_Mokhtar_AnnabaFaculté_des_Sciences_de_l’Ingéniorat",null,"U. Sétif-1-","Faculté de Médecine"]
["U02E","Est","Université Badji Mokhtar Annaba","U. Annaba","Faculté des Sciences de l’Ingéniorat","Département d’Electronique","Université_Badji_Mokhtar_AnnabaFaculté_des_Sciences_de_l’Ingéniorat",null,"U. Sétif-1-","Faculté de Technologie"]
["U02E","Est","Université Badji Mokhtar Annaba","U. Annaba","Faculté des Sciences de l’Ingéniorat","Département d’Electrotechnique","Université_Badji_Mokhtar_AnnabaFaculté_des_Sciences_de_l’Ingéniorat",null,"U. Sétif-1-","Faculté des Sciences"]
["U02E","Est","Université Badji Mokhtar Annaba","U. Annaba","Faculté des Sciences de l’Ingéniorat","Département d’Hydraulique","Université_Badji_Mokhtar_AnnabaFaculté_des_Sciences_de_l’Ingéniorat",null,"U. Sétif-1-","Faculté des Sciences de la Nature et de la Vie"]
["U02E","Est","Université Badji Mokhtar Annaba","U. Annaba","Faculté des Sciences de l’Ingéniorat","Département d’Informatique","Université_Badji_Mokhtar_AnnabaFaculté_des_Sciences_de_l’Ingéniorat",null,"U. Sétif-1-","Faculté des Sciences Economiques et Commerciales et Sciences de Gestion"]
["U02E","Est","Université Badji Mokhtar Annaba","U. Annaba","Faculté des Sciences de l’Ingéniorat","Département de Génie Civil","Université_Badji_Mokhtar_AnnabaFaculté_des_Sciences_de_l’Ingéniorat",null,"U. Sétif-1-","Institut Optique et Mécanique de Précision"]
["U02E","Est","Université Badji Mokhtar Annaba","U. Annaba","Faculté des Sciences de l’Ingéniorat","Département de Génie des Procédés","Université_Badji_Mokhtar_AnnabaFaculté_des_Sciences_de_l’Ingéniorat",null,"U. Chlef","Faculté de Droit et des Sciences Politiques"]
["U02E","Est","Université Badji Mokhtar Annaba","U. Annaba","Faculté des Sciences de l’Ingéniorat","Département de Génie Mécanique","Université_Badji_Mokhtar_AnnabaFaculté_des_Sciences_de_l’Ingéniorat",null,"U. Chlef","Faculté de Génie Civil et Architecture"]
["U02E","Est","Université Badji Mokhtar Annaba","U. Annaba","Faculté des Sciences de l’Ingéniorat","Département de Métallurgie et Génie des Matériaux",{"$f":"CONCATENATE(SUBSTITUTE(C448,\" \",\"_\"),SUBSTITUTE(E448,\" \",\"_\"))","v":"Université_Badji_Mokhtar_AnnabaFaculté_des_Sciences_de_l’Ingéniorat"},null,"U. Chlef","Faculté de Technologie"]
["U02E","Est","Université Badji Mokhtar Annaba","U. Annaba","Faculté des Sciences de l’Ingéniorat","Tronc Commun Sciences et Technologie","Université_Badji_Mokhtar_AnnabaFaculté_des_Sciences_de_l’Ingéniorat",null,"U. Chlef","Faculté des Lettres et des Langues"]
["U02E","Est","Université Badji Mokhtar Annaba","U. Annaba","Faculté des Sciences de la Terre","Département d’Aménagement du Territoire","Université_Badji_Mokhtar_AnnabaFaculté_des_Sciences_de_la_Terre",null,"U. Chlef","Faculté des Sciences"]
["U02E","Est","Université Badji Mokhtar Annaba","U. Annaba","Faculté des Sciences de la Terre","Département d’Architecture","Université_Badji_Mokhtar_AnnabaFaculté_des_Sciences_de_la_Terre",null,"U. Chlef","Faculté des Sciences Economiques Commerciales et des Sciences de Gestion"]
["U02E","Est","Université Badji Mokhtar Annaba","U. Annaba","Faculté des Sciences de la Terre","Département de Géologie","Université_Badji_Mokhtar_AnnabaFaculté_des_Sciences_de_la_Terre",null,"U. Chlef","Faculté des Sciences Humaines et Sciences Sociales"]
["U02E","Est","Université Badji Mokhtar Annaba","U. Annaba","Faculté des Sciences de la Terre","Département des Mines","Université_Badji_Mokhtar_AnnabaFaculté_des_Sciences_de_la_Terre",null,"U. Chlef","Institut Education Physique et Sportive"]
["U02E","Est","Université Badji Mokhtar Annaba","U. Annaba","Faculté des Sciences Économiques et des Sciences de Gestion","Département des Sciences Commerciales","Université_Badji_Mokhtar_AnnabaFaculté_des_Sciences_Économiques_et_des_Sciences_de_Gestion","Université_Badji_Mokhtar_AnnabaFaculté_des_Sciences_Économiques_et_des_Sciences_de_Gestion","U. Chlef","Institut des Sciences Agronomiques"]
["U02E","Est","Université Badji Mokhtar Annaba","U. Annaba","Faculté des Sciences Économiques et des Sciences de Gestion","Département des Sciences de Gestion","Université_Badji_Mokhtar_AnnabaFaculté_des_Sciences_Économiques_et_des_Sciences_de_Gestion",null,"U. Tiaret","Faculté de Droit et des Sciences Politiques"]
["U02E","Est","Université Badji Mokhtar Annaba","U. Annaba","Faculté des Sciences Économiques et des Sciences de Gestion","Département des Sciences Economiques","Université_Badji_Mokhtar_AnnabaFaculté_des_Sciences_Économiques_et_des_Sciences_de_Gestion",null,"U. Tiaret","Faculté des Lettres et des Langues"]
["U02E","Est","Université Badji Mokhtar Annaba","U. Annaba","Faculté des Sciences Économiques et des Sciences de Gestion","Département Tronc Commun","Université_Badji_Mokhtar_AnnabaFaculté_des_Sciences_Économiques_et_des_Sciences_de_Gestion",null,"U. Tiaret","Faculté des Mathématiques et de l’Informatique"]
["U01C","Centre","Université Benyoucef Benkhedda Alger","U. Alger-1-","Faculté de Droit","قسم القانون الخاص","Université_Benyoucef_Benkhedda_AlgerFaculté_de_Droit",null,"U. Tiaret","Faculté des Sciences Appliquées"]
["U01C","Centre","Université Benyoucef Benkhedda Alger","U. Alger-1-","Faculté de Droit","قسم القانون العام","Université_Benyoucef_Benkhedda_AlgerFaculté_de_Droit",null,"U. Tiaret","Faculté des Sciences de la Matière"]
["U01C","Centre","Université Benyoucef Benkhedda Alger","U. Alger-1-","Faculté des Sciences Islamique","   قسم اللغة والحضارة الإسلامية","Université_Benyoucef_Benkhedda_AlgerFaculté_des_Sciences_Islamique",null,"U. Tiaret","Faculté des Sciences de la Nature et de la Vie"]
["U01C","Centre","Université Benyoucef Benkhedda Alger","U. Alger-1-","Faculté des Sciences Islamique","  قسم الشريعة","Université_Benyoucef_Benkhedda_AlgerFaculté_des_Sciences_Islamique",null,"U. Tiaret","Faculté des Sciences Economiques des Sciences Commerciales et des Sciences de Gestion"]
["U01C","Centre","Université Benyoucef Benkhedda Alger","U. Alger-1-","Faculté des Sciences Islamique"," قسم العقائد و الأديان","Université_Benyoucef_Benkhedda_AlgerFaculté_des_Sciences_Islamique",null,"U. Tiaret","Faculté des Sciences Humaines et Sociales"]
["U01C","Centre","Université Benyoucef Benkhedda Alger","U. Alger-1-","Faculté des Sciences Médicales","Département Médecine","Université_Benyoucef_Benkhedda_AlgerFaculté_des_Sciences_Médicales",null,"U. Tiaret","Institut de Technologie"]
["U01C","Centre","Université Benyoucef Benkhedda Alger","U. Alger-1-","Faculté des Sciences Médicales","Département Médecine Dentaire","Université_Benyoucef_Benkhedda_AlgerFaculté_des_Sciences_Médicales",null,"U. Tiaret","Institut des Sciences Vétérinaires"]
["U01C","Centre","Université Benyoucef Benkhedda Alger","U. Alger-1-","Faculté des Sciences Médicales","Département Pharmacie","Université_Benyoucef_Benkhedda_AlgerFaculté_des_Sciences_Médicales",null,"U. Ouargla","Faculté de Médecine"]
["U12C","Centre","Université d'Alger 2","U. Alger-2- Bouzareah","Faculté des Lettres et des Langues",null,"Université_d'Alger_2Faculté_des_Lettres_et_des_Langues",null,"U. Ouargla","Faculté des Hydrocarbures des Energies Renouvelables des Sciences de la Terre et de l’Univers"]
["U12C","Centre","Université d'Alger 2","U. Alger-2- Bouzareah","Faculté Sciences Humaines et Sociales","Département d’Histoire","Université_d'Alger_2Faculté_Sciences_Humaines_et_Sociales",null,"U. Ouargla","Faculté des Lettres et des Langues"]
["U12C","Centre","Université d'Alger 2","U. Alger-2- Bouzareah","Faculté Sciences Humaines et Sociales","Département de Bibliothéconomie et des Sciences Documentaires","Université_d'Alger_2Faculté_Sciences_Humaines_et_Sociales",null,"U. Ouargla","Faculté des Mathématiques et des Sciences de la Matière"]
["U12C","Centre","Université d'Alger 2","U. Alger-2- Bouzareah","Faculté Sciences Humaines et Sociales","Département de Philosophie","Université_d'Alger_2Faculté_Sciences_Humaines_et_Sociales",null,"U. Ouargla","Faculté des Nouvelles Technologies de Information et de la Communication"]
["U12C","Centre","Université d'Alger 2","U. Alger-2- Bouzareah","Faculté Sciences Humaines et Sociales","Département de Psychologie, des Sciences de l’Education et de l’Orthophonie","Université_d'Alger_2Faculté_Sciences_Humaines_et_Sociales",null,"U. Ouargla","Faculté des Sciences Appliquées"]
["U12C","Centre","Université d'Alger 2","U. Alger-2- Bouzareah","Faculté Sciences Humaines et Sociales","Département de Sociologie","Université_d'Alger_2Faculté_Sciences_Humaines_et_Sociales",null,"U. Ouargla","Faculté des Sciences de la Nature et de la Vie"]
["U12C","Centre","Université d'Alger 2","U. Alger-2- Bouzareah","Institut d'Archéologie",null,"Université_d'Alger_2Institut_d'Archéologie",null,"U. Ouargla","Faculté des Sciences Économiques des Sciences Commerciales et des Sciences de Gestion"]
["U12C","Centre","Université d'Alger 2","U. Alger-2- Bouzareah","Institut d'Interprétariat",null,"Université_d'Alger_2Institut_d'Interprétariat",null,"U. Ouargla","Faculté des Sciences Humaines et Sociales"]
["U13C","Centre","Université d'Alger 3","U. Alger-3- DelyBrahim","Faculté de l’Information et de la Communication",null,"Université_d'Alger_3Faculté_de_l’Information_et_de_la_Communication",null,"U. Ouargla","Faculté Droit et Sciences Politiques"]
["U13C","Centre","Université d'Alger 3","U. Alger-3- DelyBrahim","Faculté des Sciences Economiques, Commerciales et des Sciences de Gestion",null,"Université_d'Alger_3Faculté_des_Sciences_Economiques,_Commerciales_et_des_Sciences_de_Gestion","Université_Alger_3Faculté_des_Sciences_Economiques_Commerciales_et_des_Sciences_de_Gestion","U. Ouargla","Institut de Technologie"]
["U13C","Centre","Université d'Alger 3","U. Alger-3- DelyBrahim","Faculté des Sciences Politiques et Relations Internationales",null,"Université_d'Alger_3Faculté_des_Sciences_Politiques_et_Relations_Internationales",null,"U. Ouargla","Institut des Sciences et Techniques des Activités Physiques et Sportifs"]
["U13C","Centre","Université d'Alger 3","U. Alger-3- DelyBrahim","Institut de l'Education Physiques et Sportives",null,"Université_d'Alger_3Institut_de_l'Education_Physiques_et_Sportives",null,"U. Oum El Bouaghi","Faculté de Droit et des Sciences Politiques"]
["U08O","Ouest","Université de Béchar","U. Béchar","Faculté de Droit et des Sciences Politiques",null,"Université_de_BécharFaculté_de_Droit_et_des_Sciences_Politiques",null,"U. Oum El Bouaghi","Faculté des Lettres et des Langues"]
["U08O","Ouest","Université de Béchar","U. Béchar","Faculté des Lettres, des Sciences Humaines et des Sciences Sociales","Département de Lettres","Université_de_BécharFaculté_des_Lettres,_des_Sciences_Humaines_et_des_Sciences_Sociales",null,"U. Oum El Bouaghi","Faculté des Sciences de la Terre et d'Architecture"]
["U08O","Ouest","Université de Béchar","U. Béchar","Faculté des Lettres, des Sciences Humaines et des Sciences Sociales","Département des Langues","Université_de_BécharFaculté_des_Lettres,_des_Sciences_Humaines_et_des_Sciences_Sociales",null,"U. Oum El Bouaghi","Faculté des Sciences Economiques et Commerciales et Sciences de Gestion"]
["U08O","Ouest","Université de Béchar","U. Béchar","Faculté des Lettres, des Sciences Humaines et des Sciences Sociales","Département des Sciences Humaines","Université_de_BécharFaculté_des_Lettres,_des_Sciences_Humaines_et_des_Sciences_Sociales",null,"U. Oum El Bouaghi","Faculté des Sciences et des Sciences Appliquées"]
["U08O","Ouest","Université de Béchar","U. Béchar","Faculté des Lettres, des Sciences Humaines et des Sciences Sociales","Département des Sciences Sociales","Université_de_BécharFaculté_des_Lettres,_des_Sciences_Humaines_et_des_Sciences_Sociales",null,"U. Oum El Bouaghi","Faculté des Sciences Exactes et Sciences de la Nature et de la Vie"]
["U08O","Ouest","Université de Béchar","U. Béchar","Faculté des Sciences Economiques, Commerciales et des Sciences de Gestion","Département des Sciences Économiques et commerciales ","Université_de_BécharFaculté_des_Sciences_Economiques,_Commerciales_et_des_Sciences_de_Gestion",null,"U. Oum El Bouaghi","Faculté des Sciences Sociales et Humaines"]
["U08O","Ouest","Université de Béchar","U. Béchar","Faculté des Sciences Economiques, Commerciales et des Sciences de Gestion","Département Sciences de Gestion","Université_de_BécharFaculté_des_Sciences_Economiques,_Commerciales_et_des_Sciences_de_Gestion",null,"U. Oum El Bouaghi","Institut de Gestion des Techniques Urbaines"]
["U08O","Ouest","Université de Béchar","U. Béchar","Faculté des Sciences Economiques, Commerciales et des Sciences de Gestion",null,"Université_de_BécharFaculté_des_Sciences_Economiques,_Commerciales_et_des_Sciences_de_Gestion",null,"U. Oum El Bouaghi","Institut des Sciences et Techniques des Activités Physiques et Sportifs"]
["U08O","Ouest","Université de Béchar","U. Béchar","Faculté des Sciences et Technologie",null,"Université_de_BécharFaculté_des_Sciences_et_Technologie",null,"U. Tébessa","Faculté de Droit et des Sciences Politiques"]
["U17C","Centre","Université de Blida 2","U. Blida-2-","كلية الآداب واللغات","قسم اللغة العربية و آدابها","Université_de_Blida_2كلية_الآداب_واللغات",null,"U. Tébessa","Faculté des Lettres et des Langues et des Sciences Sociales et Humaines"]
["U17C","Centre","Université de Blida 2","U. Blida-2-","كلية الآداب واللغات","قسم اللغة الفرنسية","Université_de_Blida_2كلية_الآداب_واللغات",null,"U. Tébessa","Faculté des Sciences Economiques et des Sciences Commerciales et des Sciences de Gestion"]
["U17C","Centre","Université de Blida 2","U. Blida-2-","كلية الآداب واللغات","قسم اللغة الانجليزية","Université_de_Blida_2كلية_الآداب_واللغات",null,"U. Tébessa","Faculté des Sciences et de la Technologie"]
["U17C","Centre","Université de Blida 2","U. Blida-2-","كلية الآداب واللغات","قسم اللغة الايطالية","Université_de_Blida_2كلية_الآداب_واللغات",null,"U. Tébessa","Faculté des Sciences Exactes et des Sciences de la Nature et de la Vie"]
["U17C","Centre","Université de Blida 2","U. Blida-2-","كلية الحقوق و العلوم السياسية",null,"Université_de_Blida_2كلية_الحقوق_و_العلوم_السياسية",null,"U. Constantine-1-","Faculté de Droit et des Sciences Politiques"]
["U17C","Centre","Université de Blida 2","U. Blida-2-","كلية العلوم الإقتصادية،التجارية و علوم التسيير",null,"Université_de_Blida_2كلية_العلوم_الإقتصادية،التجارية_و_علوم_التسيير",null,"U. Constantine-1-","Faculté des Lettres et des Langues"]
["U17C","Centre","Université de Blida 2","U. Blida-2-","كلية العلوم الإنسانية والإجتماعية","قسم العلوم الإنسانية وقسم العلوم الاجتماعية ","Université_de_Blida_2كلية_العلوم_الإنسانية_والإجتماعية",null,"U. Constantine-1-","Faculté des Sciences de la Technologie"]
["U18E","Est","Université de Bordj Bou Arréridj","U. Bordj Bou Arreridj","Faculté de Droit et des Sciences Politiques",null,"Université_de_Bordj_Bou_ArréridjFaculté_de_Droit_et_des_Sciences_Politiques",null,"U. Constantine-1-","Faculté des Sciences de la Terre"]
["U18E","Est","Université de Bordj Bou Arréridj","U. Bordj Bou Arreridj","Faculté des Lettres et des Langues",null,"Université_de_Bordj_Bou_ArréridjFaculté_des_Lettres_et_des_Langues",null,"U. Constantine-1-","Faculté des Sciences Exactes"]
["U18E","Est","Université de Bordj Bou Arréridj","U. Bordj Bou Arreridj","Faculté des Sciences de la Nature et de la Vie et des Sciences de la Terre et de l'Univers",null,"Université_de_Bordj_Bou_ArréridjFaculté_des_Sciences_de_la_Nature_et_de_la_Vie_et_des_Sciences_de_la_Terre_et_de_l'Univers",null,"U. Constantine-1-","Faculté Sciences de la Nature et de la Vie"]
["U18E","Est","Université de Bordj Bou Arréridj","U. Bordj Bou Arreridj","Faculté des Sciences Economiques et des Sciences Commerciales et des Sciences de Gestion",null,"Université_de_Bordj_Bou_ArréridjFaculté_des_Sciences_Economiques_et_des_Sciences_Commerciales_et_des_Sciences_de_Gestion",null,"U. Constantine-1-","Institut de Nutrition Alimentation et Technologies Agroalimentaires"]
["U18E","Est","Université de Bordj Bou Arréridj","U. Bordj Bou Arreridj","Faculté des Sciences et de la Technologie","Département Électromécanique","Université_de_Bordj_Bou_ArréridjFaculté_des_Sciences_et_de_la_Technologie",null,"U. Constantine-1-","Institut des Sciences Vétérinaires"]
["U18E","Est","Université de Bordj Bou Arréridj","U. Bordj Bou Arreridj","Faculté des Sciences et de la Technologie","Département Électronique","Université_de_Bordj_Bou_ArréridjFaculté_des_Sciences_et_de_la_Technologie",null,"U. Boumerdès","Faculté de Droit"]
["U18E","Est","Université de Bordj Bou Arréridj","U. Bordj Bou Arreridj","Faculté des Sciences et de la Technologie","Département Génie Civil","Université_de_Bordj_Bou_ArréridjFaculté_des_Sciences_et_de_la_Technologie",null,"U. Boumerdès","Faculté des Hydrocarbures et de la Chimie  "]
["U18E","Est","Université de Bordj Bou Arréridj","U. Bordj Bou Arreridj","Faculté des Sciences et de la Technologie","Département Génie de l’Environnement","Université_de_Bordj_Bou_ArréridjFaculté_des_Sciences_et_de_la_Technologie",null,"U. Boumerdès","Faculté des Sciences de l’Ingénieur"]
["U18E","Est","Université de Bordj Bou Arréridj","U. Bordj Bou Arreridj","Faculté des Sciences et de la Technologie","Département Sciences de la Matière","Université_de_Bordj_Bou_ArréridjFaculté_des_Sciences_et_de_la_Technologie",null,"U. Boumerdès","Faculté des Sciences Economiques Commerciales et des Sciences de Gestion"]
["U18E","Est","Université de Bordj Bou Arréridj","U. Bordj Bou Arreridj","Faculté des Sciences et de la Technologie","Département Sciences et Techniques","Université_de_Bordj_Bou_ArréridjFaculté_des_Sciences_et_de_la_Technologie",null,"U. Boumerdès","Faculté des Sciences"]
["U18E","Est","Université de Bordj Bou Arréridj","U. Bordj Bou Arreridj","Faculté des Sciences Sociales et Humaines","Département des Sciences Sociales et Humaines","Université_de_Bordj_Bou_ArréridjFaculté_des_Sciences_Sociales_et_Humaines",null,"U. Boumerdès","Institut de Génie Electrique et Electronique"]
["U18E","Est","Université de Bordj Bou Arréridj","U. Bordj Bou Arreridj","Faculté Mathématiques et Informatique","Département d’Informatique","Université_de_Bordj_Bou_ArréridjFaculté_Mathématiques_et_Informatique",null,"U. Biskra","Faculté  des Sciences Humaines et Sociales"]
["U18E","Est","Université de Bordj Bou Arréridj","U. Bordj Bou Arreridj","Faculté Mathématiques et Informatique","Département des Mathématiques","Université_de_Bordj_Bou_ArréridjFaculté_Mathématiques_et_Informatique",null,"U. Biskra","Faculté de Droit et des Sciences Politiques"]
["U18E","Est","Université de Bordj Bou Arréridj","U. Bordj Bou Arreridj","Faculté Mathématiques et Informatique","Département Recherche Opérationnelle","Université_de_Bordj_Bou_ArréridjFaculté_Mathématiques_et_Informatique",null,"U. Biskra","Faculté des Lettres et des Langues"]
["U14C","Centre","Université de Bouira","U. Bouira","Faculté de Droit et des Sciences Politiques","Département du Droit Privé","Université_de_BouiraFaculté_de_Droit_et_des_Sciences_Politiques",null,"U. Biskra","Faculté des Sciences Economiques Commerciales et des Sciences de Gestion"]
["U14C","Centre","Université de Bouira","U. Bouira","Faculté de Droit et des Sciences Politiques","Département du Droit Publique","Université_de_BouiraFaculté_de_Droit_et_des_Sciences_Politiques",null,"U. Biskra","Faculté des Sciences et de la Technologie"]
["U14C","Centre","Université de Bouira","U. Bouira","Faculté des Lettres et des Langues","Département Lettre et Langue Arabe","Université_de_BouiraFaculté_des_Lettres_et_des_Langues",null,"U. Biskra","Faculté des Sciences Exactes des Sciences de la Nature et de la Vie"]
["U14C","Centre","Université de Bouira","U. Bouira","Faculté des Lettres et des Langues","Département Lettre et Langue Français","Université_de_BouiraFaculté_des_Lettres_et_des_Langues",null,"U. Biskra","Institut des Sciences et Techniques des Activités Physiques et Sportifs"]
["U14C","Centre","Université de Bouira","U. Bouira","Faculté des Lettres et des Langues","Département Tamazight",{"$f":"CONCATENATE(SUBSTITUTE(C512,\" \",\"_\"),SUBSTITUTE(E512,\" \",\"_\"))","v":"Université_de_BouiraFaculté_des_Lettres_et_des_Langues"},null,"U. Tizi Ouzou","Faculté de Droit et des Sciences Politiques"]
["U14C","Centre","Université de Bouira","U. Bouira","Faculté des Sciences de la Nature et de la Vie et des Sciences de la Terre","Département de Biologie","Université_de_BouiraFaculté_des_Sciences_de_la_Nature_et_de_la_Vie_et_des_Sciences_de_la_Terre",null,"U. Tizi Ouzou","Faculté de Génie de la Construction"]
["U14C","Centre","Université de Bouira","U. Bouira","Faculté des Sciences de la Nature et de la Vie et des Sciences de la Terre","Département des Sciences Agronomiques","Université_de_BouiraFaculté_des_Sciences_de_la_Nature_et_de_la_Vie_et_des_Sciences_de_la_Terre",null,"U. Tizi Ouzou","Faculté de Médecine"]
["U14C","Centre","Université de Bouira","U. Bouira","Faculté des Sciences Economiques, Commerciales et des Sciences de Gestion","Département des Sciences Commerciales","Université_de_BouiraFaculté_des_Sciences_Economiques,_Commerciales_et_des_Sciences_de_Gestion",null,"U. Tizi Ouzou","Faculté des Lettres et Langues"]
["U14C","Centre","Université de Bouira","U. Bouira","Faculté des Sciences Economiques, Commerciales et des Sciences de Gestion","Département des Sciences de Gestion","Université_de_BouiraFaculté_des_Sciences_Economiques,_Commerciales_et_des_Sciences_de_Gestion",null,"U. Tizi Ouzou","Faculté des Sciences Biologiques et Sciences Agronomiques"]
["U14C","Centre","Université de Bouira","U. Bouira","Faculté des Sciences Economiques, Commerciales et des Sciences de Gestion","Département des Sciences Economiques","Université_de_BouiraFaculté_des_Sciences_Economiques,_Commerciales_et_des_Sciences_de_Gestion",null,"U. Tizi Ouzou","Faculté des Sciences Economiques Commerciales et des Sciences de Gestion"]
["U14C","Centre","Université de Bouira","U. Bouira","Faculté des Sciences et des Sciences Appliquées","Département d’Informatique","Université_de_BouiraFaculté_des_Sciences_et_des_Sciences_Appliquées",null,"U. Tizi Ouzou","Faculté des Sciences Humaines et Sociales"]
["U14C","Centre","Université de Bouira","U. Bouira","Faculté des Sciences et des Sciences Appliquées","Département de Chimie","Université_de_BouiraFaculté_des_Sciences_et_des_Sciences_Appliquées",null,"U. Tizi Ouzou","Faculté des Sciences"]
["U14C","Centre","Université de Bouira","U. Bouira","Faculté des Sciences et des Sciences Appliquées","Département de Génie Civil","Université_de_BouiraFaculté_des_Sciences_et_des_Sciences_Appliquées",null,"U. Tizi Ouzou","Faculté Génie Electrique et Informatique"]
["U14C","Centre","Université de Bouira","U. Bouira","Faculté des Sciences et des Sciences Appliquées","Département de Génie des Procédés","Université_de_BouiraFaculté_des_Sciences_et_des_Sciences_Appliquées",null,"U. Saida","Faculté de Technologie"]
["U14C","Centre","Université de Bouira","U. Bouira","Faculté des Sciences et des Sciences Appliquées","Département de Génie Electrique","Université_de_BouiraFaculté_des_Sciences_et_des_Sciences_Appliquées",null,"U. Saida","Faculté des Sciences Sociales et Humaines"]
["U14C","Centre","Université de Bouira","U. Bouira","Faculté des Sciences et des Sciences Appliquées","Département de Génie Mécanique","Université_de_BouiraFaculté_des_Sciences_et_des_Sciences_Appliquées",null,"U. Saida","Facultés de Droit et de Science Politique"]
["U14C","Centre","Université de Bouira","U. Bouira","Faculté des Sciences et des Sciences Appliquées","Département de Mathématiques","Université_de_BouiraFaculté_des_Sciences_et_des_Sciences_Appliquées",null,"U. Saida","Facultés des Lettres et des Langues et des Arts"]
["U14C","Centre","Université de Bouira","U. Bouira","Faculté des Sciences et des Sciences Appliquées","Département de Physique","Université_de_BouiraFaculté_des_Sciences_et_des_Sciences_Appliquées",null,"U. Saida","Facultés des Sciences"]
["U14C","Centre","Université de Bouira","U. Bouira","Faculté des Sciences Humaines et Sociales","Département des Sciences Humaines","Université_de_BouiraFaculté_des_Sciences_Humaines_et_Sociales",null,"U. Saida","Facultés des Sciences Economiques et Sciences Commerciales et Sciences de Gestions"]
["U14C","Centre","Université de Bouira","U. Bouira","Faculté des Sciences Humaines et Sociales","Département des Sciences Sociales","Université_de_BouiraFaculté_des_Sciences_Humaines_et_Sociales",null,"U. Médéa","Faculté de Droit"]
["U14C","Centre","Université de Bouira","U. Bouira","Institut des Sciences et Techniques des Activités Physiques et Sportifs","Département de l'Activité Physique Sportive et Educative","Université_de_BouiraInstitut_des_Sciences_et_Techniques_des_Activités_Physiques_et_Sportifs",null,"U. Médéa","Faculté des Lettres des Langues et des Sciences Humaines"]
["U14C","Centre","Université de Bouira","U. Bouira","Institut des Sciences et Techniques des Activités Physiques et Sportifs","Département de l'Administration et de la Gestion Sportive","Université_de_BouiraInstitut_des_Sciences_et_Techniques_des_Activités_Physiques_et_Sportifs",null,"U. Médéa","Faculté des Sciences Economiques Commerciales et des Sciences de Gestion"]
["U14C","Centre","Université de Bouira","U. Bouira","Institut des Sciences et Techniques des Activités Physiques et Sportifs","Département de l'Entraînement Sportif","Université_de_BouiraInstitut_des_Sciences_et_Techniques_des_Activités_Physiques_et_Sportifs",null,"U. Médéa","Faculté des Sciences et de la Technologie"]
["U15E","Est","Université de Constantine 2","U. Constantine-2-","Faculté de Psychologie et des Sciences de l’Education","Département de Psychologie","Université_de_Constantine_2Faculté_de_Psychologie_et_des_Sciences_de_l’Education",null,"U. Djelfa","Faculté de Droit et des Sciences Politiques"]
["U15E","Est","Université de Constantine 2","U. Constantine-2-","Faculté de Psychologie et des Sciences de l’Education","Département des Sciences de l’Education","Université_de_Constantine_2Faculté_de_Psychologie_et_des_Sciences_de_l’Education",null,"U. Djelfa","Faculté des Lettresd es Langues et des Arts"]
["U15E","Est","Université de Constantine 2","U. Constantine-2-","Faculté des Nouvelles Technologies de l’Information et de la Communication","Département des Technologies des Logiciels et des Systèmes d’Information","Université_de_Constantine_2Faculté_des_Nouvelles_Technologies_de_l’Information_et_de_la_Communication",null,"U. Djelfa","Faculté des Sciences de la Nature et de la Vie"]
["U15E","Est","Université de Constantine 2","U. Constantine-2-","Faculté des Nouvelles Technologies de l’Information et de la Communication","Département de l’Informatique Fondamentale et Ses Applications","Université_de_Constantine_2Faculté_des_Nouvelles_Technologies_de_l’Information_et_de_la_Communication",null,"U. Djelfa","Faculté des Sciences Économiques des Sciences Commerciales et des Sciences de Gestion"]
["U15E","Est","Université de Constantine 2","U. Constantine-2-","Faculté des Sciences Economiques, Commerciales et des Sciences de Gestion","Département des Sciences Economiques","Université_de_Constantine_2Faculté_des_Sciences_Economiques,_Commerciales_et_des_Sciences_de_Gestion",null,"U. Djelfa","Faculté des Sciences et de la Technologie"]
["U15E","Est","Université de Constantine 2","U. Constantine-2-","Faculté des Sciences Economiques, Commerciales et des Sciences de Gestion","Département des Sciences Commerciales","Université_de_Constantine_2Faculté_des_Sciences_Economiques,_Commerciales_et_des_Sciences_de_Gestion",null,"U. Djelfa","Faculté des Sciences Sociales et Humaines"]
["U15E","Est","Université de Constantine 2","U. Constantine-2-","Faculté des Sciences Economiques, Commerciales et des Sciences de Gestion","Département des Sciences de Gestion","Université_de_Constantine_2Faculté_des_Sciences_Economiques,_Commerciales_et_des_Sciences_de_Gestion",null,"U. Djelfa","Institut des Sciences et Techniques des Activités Physiques et Sportifs"]
["U15E","Est","Université de Constantine 2","U. Constantine-2-","Faculté des Sciences Humaines et des Sciences Sociales","Département de Philosophie","Université_de_Constantine_2Faculté_des_Sciences_Humaines_et_des_Sciences_Sociales",null,"U. Blida-1-","Faculté des Sciences"]
["U15E","Est","Université de Constantine 2","U. Constantine-2-","Faculté des Sciences Humaines et des Sciences Sociales","Département d’Archéologies et d’Histoire","Université_de_Constantine_2Faculté_des_Sciences_Humaines_et_des_Sciences_Sociales",null,"U. Blida-1-","Faculté de Technologie"]
["U15E","Est","Université de Constantine 2","U. Constantine-2-","Faculté des Sciences Humaines et des Sciences Sociales","Département de Sociologie","Université_de_Constantine_2Faculté_des_Sciences_Humaines_et_des_Sciences_Sociales",null,"U. Blida-1-","Faculté de Médecine"]
["U15E","Est","Université de Constantine 2","U. Constantine-2-","Institut de Bibliothéconomie","Département de Bibliothéconomie","Université_de_Constantine_2Institut_de_Bibliothéconomie",null,"U. Blida-1-","Faculté des Sciences de la Nature et de la Vie "]
["U15E","Est","Université de Constantine 2","U. Constantine-2-","Institut des Sciences et Techniques des Activités Physiques et Sportifs","Département de l’Education Physique et Sportive","Université_de_Constantine_2Institut_des_Sciences_et_Techniques_des_Activités_Physiques_et_Sportifs",null,"U. Blida-1-","Institut des Sciences Vétérinaires"]
["U16E","Est","Université de Constantine 3","U. Constantine-3-","Faculté d’Architecture et de Construction",null,"Université_de_Constantine_3Faculté_d’Architecture_et_de_Construction",null,"U. Blida-2-","كلية العلوم الإنسانية والإجتماعية"]
["U16E","Est","Université de Constantine 3","U. Constantine-3-","Faculté de Médecine",null,"Université_de_Constantine_3Faculté_de_Médecine",null,"U. Blida-2-","كلية الآداب واللغات"]
["U16E","Est","Université de Constantine 3","U. Constantine-3-","Faculté des méthodes pharmaceutiques Ingénierie",null,"Université_de_Constantine_3Faculté_des_méthodes_pharmaceutiques_Ingénierie",null,"U. Blida-2-","كلية الحقوق و العلوم السياسية"]
["U16E","Est","Université de Constantine 3","U. Constantine-3-","Faculté des Sciences de l'Information et de Communication ",null,"Université_de_Constantine_3Faculté_des_Sciences_de_l'Information_et_de_Communication_",null,"U. Blida-2-","كلية العلوم الإقتصادية،التجارية و علوم التسيير"]
["U16E","Est","Université de Constantine 3","U. Constantine-3-","Faculté des Sciences Politiques",null,"Université_de_Constantine_3Faculté_des_Sciences_Politiques"]
["U16C","Centre","Université de Ghardaïa","U. Ghardaia","Faculté de Droit et des Sciences Politiques","Département de Droit ","Université_de_GhardaïaFaculté_de_Droit_et_des_Sciences_Politiques"]
["U16C","Centre","Université de Ghardaïa","U. Ghardaia","Faculté des Lettres et des Langues","Département Lettre et langue Arabe","Université_de_GhardaïaFaculté_des_Lettres_et_des_Langues"]
["U16C","Centre","Université de Ghardaïa","U. Ghardaia","Faculté des Lettres et des Langues","Département Lettre et Langue Français","Université_de_GhardaïaFaculté_des_Lettres_et_des_Langues"]
["U16C","Centre","Université de Ghardaïa","U. Ghardaia","Faculté des Lettres et des Langues","Département Sciences Humaines","Université_de_GhardaïaFaculté_des_Lettres_et_des_Langues"]
["U16C","Centre","Université de Ghardaïa","U. Ghardaia","Faculté des Lettres et des Langues","Département Sciences Sociales","Université_de_GhardaïaFaculté_des_Lettres_et_des_Langues"]
["U16C","Centre","Université de Ghardaïa","U. Ghardaia","Faculté des Lettres et des Langues","Faculté des Sciences Humaines et Sociales","Université_de_GhardaïaFaculté_des_Lettres_et_des_Langues"]
["U16C","Centre","Université de Ghardaïa","U. Ghardaia","Faculté des Sciences de la Nature et de la Vie et des Sciences de la Terre","Département de Biologie","Université_de_GhardaïaFaculté_des_Sciences_de_la_Nature_et_de_la_Vie_et_des_Sciences_de_la_Terre"]
["U16C","Centre","Université de Ghardaïa","U. Ghardaia","Faculté des Sciences de la Nature et de la Vie et des Sciences de la Terre","Département des Sciences Agronomiques","Université_de_GhardaïaFaculté_des_Sciences_de_la_Nature_et_de_la_Vie_et_des_Sciences_de_la_Terre"]
["U16C","Centre","Université de Ghardaïa","U. Ghardaia","Faculté des Sciences Economiques, Commerciales et des Sciences de Gestion","Sciences Commerciales","Université_de_GhardaïaFaculté_des_Sciences_Economiques,_Commerciales_et_des_Sciences_de_Gestion"]
["U16C","Centre","Université de Ghardaïa","U. Ghardaia","Faculté des Sciences Economiques, Commerciales et des Sciences de Gestion","Sciences de Gestion","Université_de_GhardaïaFaculté_des_Sciences_Economiques,_Commerciales_et_des_Sciences_de_Gestion"]
["U16C","Centre","Université de Ghardaïa","U. Ghardaia","Faculté des Sciences Economiques, Commerciales et des Sciences de Gestion","Sciences Economiques","Université_de_GhardaïaFaculté_des_Sciences_Economiques,_Commerciales_et_des_Sciences_de_Gestion"]
["U16C","Centre","Université de Ghardaïa","U. Ghardaia","Faculté des Sciences et de la Technologie","Département de mathématiques et d’informatique ","Université_de_GhardaïaFaculté_des_Sciences_et_de_la_Technologie"]
["U16C","Centre","Université de Ghardaïa","U. Ghardaia","Faculté des Sciences et de la Technologie","Département des Sciences et de la Technologie","Université_de_GhardaïaFaculté_des_Sciences_et_de_la_Technologie"]
["U15C","Centre","Université de Khemis Miliana","U. Khemis Miliana","Faculté de Droit et des Sciences Politiques","Département de Droit","Université_de_Khemis_MilianaFaculté_de_Droit_et_des_Sciences_Politiques"]
["U15C","Centre","Université de Khemis Miliana","U. Khemis Miliana","Faculté des Lettres et des Langues","Département de la Langue Arabe","Université_de_Khemis_MilianaFaculté_des_Lettres_et_des_Langues"]
["U15C","Centre","Université de Khemis Miliana","U. Khemis Miliana","Faculté des Lettres et des Langues","Département des Lettres et Langue Française ","Université_de_Khemis_MilianaFaculté_des_Lettres_et_des_Langues"]
["U15C","Centre","Université de Khemis Miliana","U. Khemis Miliana","Faculté des Sciences de la Nature et de la Vie et des Sciences de la Terre","Département des Sciences Agronomiques ","Université_de_Khemis_MilianaFaculté_des_Sciences_de_la_Nature_et_de_la_Vie_et_des_Sciences_de_la_Terre"]
["U15C","Centre","Université de Khemis Miliana","U. Khemis Miliana","Faculté des Sciences de la Nature et de la Vie et des Sciences de la Terre","Département des Sciences Biologiques  ","Université_de_Khemis_MilianaFaculté_des_Sciences_de_la_Nature_et_de_la_Vie_et_des_Sciences_de_la_Terre"]
["U15C","Centre","Université de Khemis Miliana","U. Khemis Miliana","Faculté des Sciences de la Nature et de la Vie et des Sciences de la Terre","Département des Sciences de la Terre ","Université_de_Khemis_MilianaFaculté_des_Sciences_de_la_Nature_et_de_la_Vie_et_des_Sciences_de_la_Terre"]
["U15C","Centre","Université de Khemis Miliana","U. Khemis Miliana","Faculté des Sciences Economiques, Commerciales et des Sciences de Gestion","Département des Sciences Commerciales","Université_de_Khemis_MilianaFaculté_des_Sciences_Economiques,_Commerciales_et_des_Sciences_de_Gestion"]
["U15C","Centre","Université de Khemis Miliana","U. Khemis Miliana","Faculté des Sciences Economiques, Commerciales et des Sciences de Gestion","Département des Sciences de Gestion","Université_de_Khemis_MilianaFaculté_des_Sciences_Economiques,_Commerciales_et_des_Sciences_de_Gestion"]
["U15C","Centre","Université de Khemis Miliana","U. Khemis Miliana","Faculté des Sciences Economiques, Commerciales et des Sciences de Gestion","Département des Sciences Economiques","Université_de_Khemis_MilianaFaculté_des_Sciences_Economiques,_Commerciales_et_des_Sciences_de_Gestion"]
["U15C","Centre","Université de Khemis Miliana","U. Khemis Miliana","Faculté des Sciences et de la Technologie","Département de la Technologie  ","Université_de_Khemis_MilianaFaculté_des_Sciences_et_de_la_Technologie"]
["U15C","Centre","Université de Khemis Miliana","U. Khemis Miliana","Faculté des Sciences et de la Technologie","Département des Mathématiques et Informatiques ","Université_de_Khemis_MilianaFaculté_des_Sciences_et_de_la_Technologie"]
["U15C","Centre","Université de Khemis Miliana","U. Khemis Miliana","Faculté des Sciences et de la Technologie","Département des Sciences de la Matière  ","Université_de_Khemis_MilianaFaculté_des_Sciences_et_de_la_Technologie"]
["U15C","Centre","Université de Khemis Miliana","U. Khemis Miliana","Faculté des Sciences Sociales et Humaines","Département des Sciences Humaines  ","Université_de_Khemis_MilianaFaculté_des_Sciences_Sociales_et_Humaines"]
["U15C","Centre","Université de Khemis Miliana","U. Khemis Miliana","Faculté des Sciences Sociales et Humaines","Département des Sciences Sociales","Université_de_Khemis_MilianaFaculté_des_Sciences_Sociales_et_Humaines"]
["U15C","Centre","Université de Khemis Miliana","U. Khemis Miliana","Institut des Sciences et Techniques des Activités Physiques et Sportifs","Département d'Activité Physique et Sportive","Université_de_Khemis_MilianaInstitut_des_Sciences_et_Techniques_des_Activités_Physiques_et_Sportifs"]
["U15C","Centre","Université de Khemis Miliana","U. Khemis Miliana","Institut des Sciences et Techniques des Activités Physiques et Sportifs","Département d'Education Sportive",{"$f":"CONCATENATE(SUBSTITUTE(C576,\" \",\"_\"),SUBSTITUTE(E576,\" \",\"_\"))","v":"Université_de_Khemis_MilianaInstitut_des_Sciences_et_Techniques_des_Activités_Physiques_et_Sportifs"}]
["U19E","Est","Université de Khenchela","U. Khenchela","Faculté de Droit et des Sciences Politiques","Département de Droit","Université_de_KhenchelaFaculté_de_Droit_et_des_Sciences_Politiques"]
["U19E","Est","Université de Khenchela","U. Khenchela","Faculté de Droit et des Sciences Politiques","Département des Sciences Politiques","Université_de_KhenchelaFaculté_de_Droit_et_des_Sciences_Politiques"]
["U19E","Est","Université de Khenchela","U. Khenchela","Faculté des Lettres et Langues ","Département de Langue et Littérature Arabe","Université_de_KhenchelaFaculté_des_Lettres_et_Langues "]
["U19E","Est","Université de Khenchela","U. Khenchela","Faculté des Lettres et Langues ","Département des Lettres et Langues Etrangères","Université_de_KhenchelaFaculté_des_Lettres_et_Langues "]
["U19E","Est","Université de Khenchela","U. Khenchela","Faculté des Sciences de la Nature et de la Vie ","Département de Biologie","Université_de_KhenchelaFaculté_des_Sciences_de_la_Nature_et_de_la_Vie_"]
["U19E","Est","Université de Khenchela","U. Khenchela","Faculté des Sciences de la Nature et de la Vie ","Département de Biologie Cellulaire et Biotechnologie","Université_de_KhenchelaFaculté_des_Sciences_de_la_Nature_et_de_la_Vie_"]
["U19E","Est","Université de Khenchela","U. Khenchela","Faculté des Sciences de la Nature et de la Vie ","Département d'Ecologie et Environnement","Université_de_KhenchelaFaculté_des_Sciences_de_la_Nature_et_de_la_Vie_"]
["U19E","Est","Université de Khenchela","U. Khenchela","Faculté des Sciences de la Nature et de la Vie ","Département des Sciences Agronomique","Université_de_KhenchelaFaculté_des_Sciences_de_la_Nature_et_de_la_Vie_"]
["U19E","Est","Université de Khenchela","U. Khenchela","Faculté des Sciences Economiques, Commerciales et des Sciences de Gestion","Département des Sciences Commerciales","Université_de_KhenchelaFaculté_des_Sciences_Economiques,_Commerciales_et_des_Sciences_de_Gestion"]
["U19E","Est","Université de Khenchela","U. Khenchela","Faculté des Sciences Economiques, Commerciales et des Sciences de Gestion","Département des Sciences de Gestion","Université_de_KhenchelaFaculté_des_Sciences_Economiques,_Commerciales_et_des_Sciences_de_Gestion"]
["U19E","Est","Université de Khenchela","U. Khenchela","Faculté des Sciences Economiques, Commerciales et des Sciences de Gestion","Département des Sciences Economiques","Université_de_KhenchelaFaculté_des_Sciences_Economiques,_Commerciales_et_des_Sciences_de_Gestion"]
["U19E","Est","Université de Khenchela","U. Khenchela","Faculté des Sciences et de la Technologie","Département des Mathématiques et Informatique","Université_de_KhenchelaFaculté_des_Sciences_et_de_la_Technologie"]
["U19E","Est","Université de Khenchela","U. Khenchela","Faculté des Sciences et de la Technologie","Département des Sciences de la Matière","Université_de_KhenchelaFaculté_des_Sciences_et_de_la_Technologie"]
["U19E","Est","Université de Khenchela","U. Khenchela","Faculté des Sciences et de la Technologie","Département des Sciences et Technologie","Université_de_KhenchelaFaculté_des_Sciences_et_de_la_Technologie"]
["U19E","Est","Université de Khenchela","U. Khenchela","Faculté des Sciences Sociales et Humaines","Département des Sciences Humaines","Université_de_KhenchelaFaculté_des_Sciences_Sociales_et_Humaines"]
["U19E","Est","Université de Khenchela","U. Khenchela","Faculté des Sciences Sociales et Humaines","Département des Sciences Sociales","Université_de_KhenchelaFaculté_des_Sciences_Sociales_et_Humaines"]
["U09O","Ouest","Université de Mascara","U. Mascara","Faculté des Droits et des Sciences Politiques",null,"Université_de_MascaraFaculté_des_Droits_et_des_Sciences_Politiques"]
["U09O","Ouest","Université de Mascara","U. Mascara","Faculté des Lettres et des Langues","Département de Langue et Littérature Anglaises","Université_de_MascaraFaculté_des_Lettres_et_des_Langues"]
["U09O","Ouest","Université de Mascara","U. Mascara","Faculté des Lettres et des Langues","Département de Langue et Littérature Arabes","Université_de_MascaraFaculté_des_Lettres_et_des_Langues"]
["U09O","Ouest","Université de Mascara","U. Mascara","Faculté des Lettres et des Langues","Département de Langue et Littérature Françaises","Université_de_MascaraFaculté_des_Lettres_et_des_Langues"]
["U09O","Ouest","Université de Mascara","U. Mascara","Faculté des Sciences de la Nature et de la Vie ","Département d'Agronomie","Université_de_MascaraFaculté_des_Sciences_de_la_Nature_et_de_la_Vie_"]
["U09O","Ouest","Université de Mascara","U. Mascara","Faculté des Sciences de la Nature et de la Vie ","Département de Biologie","Université_de_MascaraFaculté_des_Sciences_de_la_Nature_et_de_la_Vie_"]
["U09O","Ouest","Université de Mascara","U. Mascara","Faculté des Sciences Economiques, Commerciales et des Sciences de Gestion","Département des Sciences Commerciales","Université_de_MascaraFaculté_des_Sciences_Economiques,_Commerciales_et_des_Sciences_de_Gestion"]
["U09O","Ouest","Université de Mascara","U. Mascara","Faculté des Sciences Economiques, Commerciales et des Sciences de Gestion","Département des Sciences de Gestion","Université_de_MascaraFaculté_des_Sciences_Economiques,_Commerciales_et_des_Sciences_de_Gestion"]
["U09O","Ouest","Université de Mascara","U. Mascara","Faculté des Sciences Economiques, Commerciales et des Sciences de Gestion","Département des Sciences Economiques","Université_de_MascaraFaculté_des_Sciences_Economiques,_Commerciales_et_des_Sciences_de_Gestion"]
["U09O","Ouest","Université de Mascara","U. Mascara","Faculté des Sciences et de la Technologie","Département de Math et informatique","Université_de_MascaraFaculté_des_Sciences_et_de_la_Technologie"]
["U09O","Ouest","Université de Mascara","U. Mascara","Faculté des Sciences et de la Technologie","Département de Science de la Matière","Université_de_MascaraFaculté_des_Sciences_et_de_la_Technologie"]
["U09O","Ouest","Université de Mascara","U. Mascara","Faculté des Sciences et de la Technologie","Département des Sciences et Technologie","Université_de_MascaraFaculté_des_Sciences_et_de_la_Technologie"]
["U09O","Ouest","Université de Mascara","U. Mascara","Faculté des Sciences Humaines et Sociales","Département de Philosophie","Université_de_MascaraFaculté_des_Sciences_Humaines_et_Sociales"]
["U09O","Ouest","Université de Mascara","U. Mascara","Faculté des Sciences Humaines et Sociales","Département de Psychologie et Science de l'Education","Université_de_MascaraFaculté_des_Sciences_Humaines_et_Sociales"]
["U09O","Ouest","Université de Mascara","U. Mascara","Faculté des Sciences Humaines et Sociales","Département des Sciences Humaines","Université_de_MascaraFaculté_des_Sciences_Humaines_et_Sociales"]
["U09O","Ouest","Université de Mascara","U. Mascara","Faculté des Sciences Humaines et Sociales","Département des Sciences Sociales","Université_de_MascaraFaculté_des_Sciences_Humaines_et_Sociales"]
["U10E","Est","Université de Msila","U. M'sila","Faculté de Droit et des Sciences Politiques","Département de Droit","Université_de_MsilaFaculté_de_Droit_et_des_Sciences_Politiques"]
["U10E","Est","Université de Msila","U. M'sila","Faculté de Droit et des Sciences Politiques","Département des Sciences Politiques","Université_de_MsilaFaculté_de_Droit_et_des_Sciences_Politiques"]
["U10E","Est","Université de Msila","U. M'sila","Faculté de Technologie","Département de Génie Civil","Université_de_MsilaFaculté_de_Technologie"]
["U10E","Est","Université de Msila","U. M'sila","Faculté de Technologie","Département de Génie Electrique","Université_de_MsilaFaculté_de_Technologie"]
["U10E","Est","Université de Msila","U. M'sila","Faculté de Technologie","Département de Génie Mécanique","Université_de_MsilaFaculté_de_Technologie"]
["U10E","Est","Université de Msila","U. M'sila","Faculté de Technologie","Département d'Electronique","Université_de_MsilaFaculté_de_Technologie"]
["U10E","Est","Université de Msila","U. M'sila","Faculté de Technologie","Département d'Hydraulique","Université_de_MsilaFaculté_de_Technologie"]
["U10E","Est","Université de Msila","U. M'sila","Faculté des Lettres et des Langues","Département de Langue et Littérature Arabe","Université_de_MsilaFaculté_des_Lettres_et_des_Langues"]
["U10E","Est","Université de Msila","U. M'sila","Faculté des Lettres et des Langues","Département de lettres et langues anglaise","Université_de_MsilaFaculté_des_Lettres_et_des_Langues"]
["U10E","Est","Université de Msila","U. M'sila","Faculté des Lettres et des Langues","Département de Littérature et Langue Française","Université_de_MsilaFaculté_des_Lettres_et_des_Langues"]
["U10E","Est","Université de Msila","U. M'sila","Faculté des Mathématiques et de l’Informatique","Département de Mathématique","Université_de_MsilaFaculté_des_Mathématiques_et_de_l’Informatique"]
["U10E","Est","Université de Msila","U. M'sila","Faculté des Mathématiques et de l’Informatique","Département d'informatique","Université_de_MsilaFaculté_des_Mathématiques_et_de_l’Informatique"]
["U10E","Est","Université de Msila","U. M'sila","Faculté des Sciences","Département de Biochimie et Microbiologie","Université_de_MsilaFaculté_des_Sciences"]
["U10E","Est","Université de Msila","U. M'sila","Faculté des Sciences","Département de Chimie","Université_de_MsilaFaculté_des_Sciences"]
["U10E","Est","Université de Msila","U. M'sila","Faculté des Sciences","Département de Physique","Université_de_MsilaFaculté_des_Sciences"]
["U10E","Est","Université de Msila","U. M'sila","Faculté des Sciences","Département des Sciences Agronomique","Université_de_MsilaFaculté_des_Sciences"]
["U10E","Est","Université de Msila","U. M'sila","Faculté des Sciences","Département des Sciences de la Nature et de la Vie","Université_de_MsilaFaculté_des_Sciences"]
["U10E","Est","Université de Msila","U. M'sila","Faculté des Sciences Economiques, Commerciales et des Sciences de Gestion","Département des Sciences Commerciales","Université_de_MsilaFaculté_des_Sciences_Economiques,_Commerciales_et_des_Sciences_de_Gestion"]
["U10E","Est","Université de Msila","U. M'sila","Faculté des Sciences Economiques, Commerciales et des Sciences de Gestion","Département des Sciences de Gestion","Université_de_MsilaFaculté_des_Sciences_Economiques,_Commerciales_et_des_Sciences_de_Gestion"]
["U10E","Est","Université de Msila","U. M'sila","Faculté des Sciences Economiques, Commerciales et des Sciences de Gestion","Département des Sciences Economiques","Université_de_MsilaFaculté_des_Sciences_Economiques,_Commerciales_et_des_Sciences_de_Gestion"]
["U10E","Est","Université de Msila","U. M'sila","Faculté des Sciences Humaines et des Sciences Sociales","Département de Philosophie ","Université_de_MsilaFaculté_des_Sciences_Humaines_et_des_Sciences_Sociales"]
["U10E","Est","Université de Msila","U. M'sila","Faculté des Sciences Humaines et des Sciences Sociales","Département de Psychologie ","Université_de_MsilaFaculté_des_Sciences_Humaines_et_des_Sciences_Sociales"]
["U10E","Est","Université de Msila","U. M'sila","Faculté des Sciences Humaines et des Sciences Sociales","Département de Sociologie ","Université_de_MsilaFaculté_des_Sciences_Humaines_et_des_Sciences_Sociales"]
["U10E","Est","Université de Msila","U. M'sila","Faculté des Sciences Humaines et des Sciences Sociales","Département des Sciences de la Communication ","Université_de_MsilaFaculté_des_Sciences_Humaines_et_des_Sciences_Sociales"]
["U10E","Est","Université de Msila","U. M'sila","Faculté des Sciences Humaines et des Sciences Sociales","Département d'Histoire","Université_de_MsilaFaculté_des_Sciences_Humaines_et_des_Sciences_Sociales"]
["U17E","Est","Université de Sétif 2","U. Sétif-2-","Faculté de Droit et des Sciences Politiques","Département de Droit ","Université_de_Sétif_2Faculté_de_Droit_et_des_Sciences_Politiques"]
["U17E","Est","Université de Sétif 2","U. Sétif-2-","Faculté des Lettres et des Langues","Département de la Langue Anglaise","Université_de_Sétif_2Faculté_des_Lettres_et_des_Langues"]
["U17E","Est","Université de Sétif 2","U. Sétif-2-","Faculté des Lettres et des Langues","Département de la Langue Française","Université_de_Sétif_2Faculté_des_Lettres_et_des_Langues"]
["U17E","Est","Université de Sétif 2","U. Sétif-2-","Faculté des Lettres et des Langues","Département de Langue et Littérature Arabe","Université_de_Sétif_2Faculté_des_Lettres_et_des_Langues"]
["U17E","Est","Université de Sétif 2","U. Sétif-2-","Faculté des Sciences Sociales et Humaines","Département des Sciences Humaines","Université_de_Sétif_2Faculté_des_Sciences_Sociales_et_Humaines"]
["U17E","Est","Université de Sétif 2","U. Sétif-2-","Faculté des Sciences Sociales et Humaines","Département des Sciences Sociales","Université_de_Sétif_2Faculté_des_Sciences_Sociales_et_Humaines"]
["U12E","Est","Université de Souk Ahras","U. Souk Ahras","Faculté de Droit et des Sciences Politiques","Département de Droit",{"$f":"CONCATENATE(SUBSTITUTE(C640,\" \",\"_\"),SUBSTITUTE(E640,\" \",\"_\"))","v":"Université_de_Souk_AhrasFaculté_de_Droit_et_des_Sciences_Politiques"}]
["U12E","Est","Université de Souk Ahras","U. Souk Ahras","Faculté de Droit et des Sciences Politiques","Département des Sciences Politiques","Université_de_Souk_AhrasFaculté_de_Droit_et_des_Sciences_Politiques"]
["U12E","Est","Université de Souk Ahras","U. Souk Ahras","Faculté des Lettres et Langues ","Département de Langue Arabe","Université_de_Souk_AhrasFaculté_des_Lettres_et_Langues "]
["U12E","Est","Université de Souk Ahras","U. Souk Ahras","Faculté des Lettres et Langues ","Département des Langues Étrangères","Université_de_Souk_AhrasFaculté_des_Lettres_et_Langues "]
["U12E","Est","Université de Souk Ahras","U. Souk Ahras","Faculté des Sciences de la Nature et de la Vie ","Département de Biologie Animale","Université_de_Souk_AhrasFaculté_des_Sciences_de_la_Nature_et_de_la_Vie_"]
["U12E","Est","Université de Souk Ahras","U. Souk Ahras","Faculté des Sciences de la Nature et de la Vie ","Département de Biologie Végétale ","Université_de_Souk_AhrasFaculté_des_Sciences_de_la_Nature_et_de_la_Vie_"]
["U12E","Est","Université de Souk Ahras","U. Souk Ahras","Faculté des Sciences de la Nature et de la Vie ","Département des Troncs Communs","Université_de_Souk_AhrasFaculté_des_Sciences_de_la_Nature_et_de_la_Vie_"]
["U12E","Est","Université de Souk Ahras","U. Souk Ahras","Faculté des Sciences Economiques et Commerciales et Sciences de Gestion","Département des Sciences Commerciales","Université_de_Souk_AhrasFaculté_des_Sciences_Economiques_et_Commerciales_et_Sciences_de_Gestion"]
["U12E","Est","Université de Souk Ahras","U. Souk Ahras","Faculté des Sciences Economiques et Commerciales et Sciences de Gestion","Département des Sciences de Gestion","Université_de_Souk_AhrasFaculté_des_Sciences_Economiques_et_Commerciales_et_Sciences_de_Gestion"]
["U12E","Est","Université de Souk Ahras","U. Souk Ahras","Faculté des Sciences Economiques et Commerciales et Sciences de Gestion","Département des Sciences Economiques","Université_de_Souk_AhrasFaculté_des_Sciences_Economiques_et_Commerciales_et_Sciences_de_Gestion"]
["U12E","Est","Université de Souk Ahras","U. Souk Ahras","Faculté des Sciences et Technologie","Département de Génie Civil ","Université_de_Souk_AhrasFaculté_des_Sciences_et_Technologie"]
["U12E","Est","Université de Souk Ahras","U. Souk Ahras","Faculté des Sciences et Technologie","Département de Génie des Procédés","Université_de_Souk_AhrasFaculté_des_Sciences_et_Technologie"]
["U12E","Est","Université de Souk Ahras","U. Souk Ahras","Faculté des Sciences et Technologie","Département de Génie Electrique","Université_de_Souk_AhrasFaculté_des_Sciences_et_Technologie"]
["U12E","Est","Université de Souk Ahras","U. Souk Ahras","Faculté des Sciences et Technologie","Département de Génie Mécanique ","Université_de_Souk_AhrasFaculté_des_Sciences_et_Technologie"]
["U12E","Est","Université de Souk Ahras","U. Souk Ahras","Faculté des Sciences et Technologie","Département des Mathématiques et Informatique ","Université_de_Souk_AhrasFaculté_des_Sciences_et_Technologie"]
["U12E","Est","Université de Souk Ahras","U. Souk Ahras","Faculté des Sciences et Technologie","Département des Sciences de la Matière","Université_de_Souk_AhrasFaculté_des_Sciences_et_Technologie"]
["U12E","Est","Université de Souk Ahras","U. Souk Ahras","Faculté des Sciences et Technologie","Département des Troncs Communs","Université_de_Souk_AhrasFaculté_des_Sciences_et_Technologie"]
["U12E","Est","Université de Souk Ahras","U. Souk Ahras","Faculté des Sciences Sociales et Humaines","Département des Sciences Humaines","Université_de_Souk_AhrasFaculté_des_Sciences_Sociales_et_Humaines"]
["U12E","Est","Université de Souk Ahras","U. Souk Ahras","Faculté des Sciences Sociales et Humaines","Département des Sciences Sociales","Université_de_Souk_AhrasFaculté_des_Sciences_Sociales_et_Humaines"]
["U12E","Est","Université de Souk Ahras","U. Souk Ahras","Institut d'Education Physique et Sportive ",null,"Université_de_Souk_AhrasInstitut_d'Education_Physique_et_Sportive "]
["U12E","Est","Université de Souk Ahras","U. Souk Ahras","Institut des Sciences Agronomiques et Vétérinaires","Département des Sciences Agronomiques ","Université_de_Souk_AhrasInstitut_des_Sciences_Agronomiques_et_Vétérinaires"]
["U12E","Est","Université de Souk Ahras","U. Souk Ahras","Institut des Sciences Agronomiques et Vétérinaires","Département des Sciences Vétérinaire ","Université_de_Souk_AhrasInstitut_des_Sciences_Agronomiques_et_Vétérinaires"]
["U02C","Centre","Université des Sciences et de la Technologie Houari Boumediène","U. STHB","Faculté d’Electronique et d’Informatique ","Département d’Electrotechnique","Université_des_Sciences_et_de_la_Technologie_Houari_BoumedièneFaculté_d’Electronique_et_d’Informatique "]
["U02C","Centre","Université des Sciences et de la Technologie Houari Boumediène","U. STHB","Faculté d’Electronique et d’Informatique ","Département d’Informatique","Université_des_Sciences_et_de_la_Technologie_Houari_BoumedièneFaculté_d’Electronique_et_d’Informatique "]
["U02C","Centre","Université des Sciences et de la Technologie Houari Boumediène","U. STHB","Faculté d’Electronique et d’Informatique ","Département d’Instrumentation et d’Automatique","Université_des_Sciences_et_de_la_Technologie_Houari_BoumedièneFaculté_d’Electronique_et_d’Informatique "]
["U02C","Centre","Université des Sciences et de la Technologie Houari Boumediène","U. STHB","Faculté d’Electronique et d’Informatique ","Département de Télécommunication","Université_des_Sciences_et_de_la_Technologie_Houari_BoumedièneFaculté_d’Electronique_et_d’Informatique "]
["U02C","Centre","Université des Sciences et de la Technologie Houari Boumediène","U. STHB","Faculté de Chimie ","Département de Chimie et Physique des Matériaux Inorganique","Université_des_Sciences_et_de_la_Technologie_Houari_BoumedièneFaculté_de_Chimie "]
["U02C","Centre","Université des Sciences et de la Technologie Houari Boumediène","U. STHB","Faculté de Chimie ","Département de Chimie Macromoléculaire","Université_des_Sciences_et_de_la_Technologie_Houari_BoumedièneFaculté_de_Chimie "]
["U02C","Centre","Université des Sciences et de la Technologie Houari Boumediène","U. STHB","Faculté de Chimie ","Département de Chimie Organique Appliquée","Université_des_Sciences_et_de_la_Technologie_Houari_BoumedièneFaculté_de_Chimie "]
["U02C","Centre","Université des Sciences et de la Technologie Houari Boumediène","U. STHB","Faculté de Chimie ","Département de Chimie Physique et Théorique","Université_des_Sciences_et_de_la_Technologie_Houari_BoumedièneFaculté_de_Chimie "]
["U02C","Centre","Université des Sciences et de la Technologie Houari Boumediène","U. STHB","Faculté de Génie Civil ","Département de Géotechnique et Hydraulique","Université_des_Sciences_et_de_la_Technologie_Houari_BoumedièneFaculté_de_Génie_Civil "]
["U02C","Centre","Université des Sciences et de la Technologie Houari Boumediène","U. STHB","Faculté de Génie Civil ","Département des Structures et matériaux","Université_des_Sciences_et_de_la_Technologie_Houari_BoumedièneFaculté_de_Génie_Civil "]
["U02C","Centre","Université des Sciences et de la Technologie Houari Boumediène","U. STHB","Faculté de Génie Mécanique et Génie des Procédés ","Département Construction Mécanique & Productique","Université_des_Sciences_et_de_la_Technologie_Houari_BoumedièneFaculté_de_Génie_Mécanique_et_Génie_des_Procédés "]
["U02C","Centre","Université des Sciences et de la Technologie Houari Boumediène","U. STHB","Faculté de Génie Mécanique et Génie des Procédés ","Département Génie Chimique et Cryogénie","Université_des_Sciences_et_de_la_Technologie_Houari_BoumedièneFaculté_de_Génie_Mécanique_et_Génie_des_Procédés "]
["U02C","Centre","Université des Sciences et de la Technologie Houari Boumediène","U. STHB","Faculté de Génie Mécanique et Génie des Procédés ","Département Génie Environnement et Génie Pharmaceutique","Université_des_Sciences_et_de_la_Technologie_Houari_BoumedièneFaculté_de_Génie_Mécanique_et_Génie_des_Procédés "]
["U02C","Centre","Université des Sciences et de la Technologie Houari Boumediène","U. STHB","Faculté de Génie Mécanique et Génie des Procédés ","Département Sciences des Matériaux","Université_des_Sciences_et_de_la_Technologie_Houari_BoumedièneFaculté_de_Génie_Mécanique_et_Génie_des_Procédés "]
["U02C","Centre","Université des Sciences et de la Technologie Houari Boumediène","U. STHB","Faculté de Génie Mécanique et Génie des Procédés ","Département Thermo Énergétique","Université_des_Sciences_et_de_la_Technologie_Houari_BoumedièneFaculté_de_Génie_Mécanique_et_Génie_des_Procédés "]
["U02C","Centre","Université des Sciences et de la Technologie Houari Boumediène","U. STHB","Faculté de Mathématique ","Département d’Algèbre et Théorie des Nombres","Université_des_Sciences_et_de_la_Technologie_Houari_BoumedièneFaculté_de_Mathématique "]
["U02C","Centre","Université des Sciences et de la Technologie Houari Boumediène","U. STHB","Faculté de Mathématique ","Département d’Analyse","Université_des_Sciences_et_de_la_Technologie_Houari_BoumedièneFaculté_de_Mathématique "]
["U02C","Centre","Université des Sciences et de la Technologie Houari Boumediène","U. STHB","Faculté de Mathématique ","Département de Probabilités-Statistiques ","Université_des_Sciences_et_de_la_Technologie_Houari_BoumedièneFaculté_de_Mathématique "]
["U02C","Centre","Université des Sciences et de la Technologie Houari Boumediène","U. STHB","Faculté de Mathématique ","Département de Recherche Opérationnelle","Université_des_Sciences_et_de_la_Technologie_Houari_BoumedièneFaculté_de_Mathématique "]
["U02C","Centre","Université des Sciences et de la Technologie Houari Boumediène","U. STHB","Faculté de Physique ","Département d’Energétique et Mécanique des Fluides.","Université_des_Sciences_et_de_la_Technologie_Houari_BoumedièneFaculté_de_Physique "]
["U02C","Centre","Université des Sciences et de la Technologie Houari Boumediène","U. STHB","Faculté de Physique ","Département de Physique de Rayonnement.","Université_des_Sciences_et_de_la_Technologie_Houari_BoumedièneFaculté_de_Physique "]
["U02C","Centre","Université des Sciences et de la Technologie Houari Boumediène","U. STHB","Faculté de Physique ","Département de Physique Théorique.","Université_des_Sciences_et_de_la_Technologie_Houari_BoumedièneFaculté_de_Physique "]
["U02C","Centre","Université des Sciences et de la Technologie Houari Boumediène","U. STHB","Faculté de Physique ","Département Matériaux et Composants","Université_des_Sciences_et_de_la_Technologie_Houari_BoumedièneFaculté_de_Physique "]
["U02C","Centre","Université des Sciences et de la Technologie Houari Boumediène","U. STHB","Faculté des Sciences Biologiques ","Département d’Écologie et Environnement","Université_des_Sciences_et_de_la_Technologie_Houari_BoumedièneFaculté_des_Sciences_Biologiques "]
["U02C","Centre","Université des Sciences et de la Technologie Houari Boumediène","U. STHB","Faculté des Sciences Biologiques ","Département de Biologie Cellulaire et Moléculaire","Université_des_Sciences_et_de_la_Technologie_Houari_BoumedièneFaculté_des_Sciences_Biologiques "]
["U02C","Centre","Université des Sciences et de la Technologie Houari Boumediène","U. STHB","Faculté des Sciences Biologiques ","Département de Biologie et Physiologie des Organismes","Université_des_Sciences_et_de_la_Technologie_Houari_BoumedièneFaculté_des_Sciences_Biologiques "]
["U02C","Centre","Université des Sciences et de la Technologie Houari Boumediène","U. STHB","Faculté des Sciences de la Terre de Géographie et de l’Aménagement du Territoire ","Département de Géologie","Université_des_Sciences_et_de_la_Technologie_Houari_BoumedièneFaculté_des_Sciences_de_la_Terre_de_Géographie_et_de_l’Aménagement_du_Territoire "]
["U02C","Centre","Université des Sciences et de la Technologie Houari Boumediène","U. STHB","Faculté des Sciences de la Terre de Géographie et de l’Aménagement du Territoire ","Département de Géophysique ","Université_des_Sciences_et_de_la_Technologie_Houari_BoumedièneFaculté_des_Sciences_de_la_Terre_de_Géographie_et_de_l’Aménagement_du_Territoire "]
["U02C","Centre","Université des Sciences et de la Technologie Houari Boumediène","U. STHB","Faculté des Sciences de la Terre de Géographie et de l’Aménagement du Territoire ","Département Géographie et de l’Aménagement du Territoire","Université_des_Sciences_et_de_la_Technologie_Houari_BoumedièneFaculté_des_Sciences_de_la_Terre_de_Géographie_et_de_l’Aménagement_du_Territoire "]
["U01O","Ouest","Université des Sciences et de la Technologie Mohamed Boudiaf Oran","U. STO","Faculté d’Architecture et de Génie Civil","Département d’Architecture","Université_des_Sciences_et_de_la_Technologie_Mohamed_Boudiaf_OranFaculté_d’Architecture_et_de_Génie_Civil"]
["U01O","Ouest","Université des Sciences et de la Technologie Mohamed Boudiaf Oran","U. STO","Faculté d’Architecture et de Génie Civil","Département d’Hydraulique","Université_des_Sciences_et_de_la_Technologie_Mohamed_Boudiaf_OranFaculté_d’Architecture_et_de_Génie_Civil"]
["U01O","Ouest","Université des Sciences et de la Technologie Mohamed Boudiaf Oran","U. STO","Faculté d’Architecture et de Génie Civil","Département de Génie Civil","Université_des_Sciences_et_de_la_Technologie_Mohamed_Boudiaf_OranFaculté_d’Architecture_et_de_Génie_Civil"]
["U01O","Ouest","Université des Sciences et de la Technologie Mohamed Boudiaf Oran","U. STO","Faculté de Chimie ",null,"Université_des_Sciences_et_de_la_Technologie_Mohamed_Boudiaf_OranFaculté_de_Chimie "]
["U01O","Ouest","Université des Sciences et de la Technologie Mohamed Boudiaf Oran","U. STO","Faculté de Génie Mécanique","Département de Technologie des Matériaux","Université_des_Sciences_et_de_la_Technologie_Mohamed_Boudiaf_OranFaculté_de_Génie_Mécanique"]
["U01O","Ouest","Université des Sciences et de la Technologie Mohamed Boudiaf Oran","U. STO","Faculté de Génie Mécanique","Département des Mines et Métallurgie","Université_des_Sciences_et_de_la_Technologie_Mohamed_Boudiaf_OranFaculté_de_Génie_Mécanique"]
["U01O","Ouest","Université des Sciences et de la Technologie Mohamed Boudiaf Oran","U. STO","Faculté de Génie Mécanique","Département du Génie Mécanique","Université_des_Sciences_et_de_la_Technologie_Mohamed_Boudiaf_OranFaculté_de_Génie_Mécanique"]
["U01O","Ouest","Université des Sciences et de la Technologie Mohamed Boudiaf Oran","U. STO","Faculté de Physique ","Département de Génie physique","Université_des_Sciences_et_de_la_Technologie_Mohamed_Boudiaf_OranFaculté_de_Physique "]
["U01O","Ouest","Université des Sciences et de la Technologie Mohamed Boudiaf Oran","U. STO","Faculté de Physique ","Département de Physique Energétique","Université_des_Sciences_et_de_la_Technologie_Mohamed_Boudiaf_OranFaculté_de_Physique "]
["U01O","Ouest","Université des Sciences et de la Technologie Mohamed Boudiaf Oran","U. STO","Faculté de Physique ","Département du Génie Maritime","Université_des_Sciences_et_de_la_Technologie_Mohamed_Boudiaf_OranFaculté_de_Physique "]
["U01O","Ouest","Université des Sciences et de la Technologie Mohamed Boudiaf Oran","U. STO","Faculté des Mathématiques et de l’Informatique","Département des Mathématiques","Université_des_Sciences_et_de_la_Technologie_Mohamed_Boudiaf_OranFaculté_des_Mathématiques_et_de_l’Informatique"]
["U01O","Ouest","Université des Sciences et de la Technologie Mohamed Boudiaf Oran","U. STO","Faculté des Mathématiques et de l’Informatique","Départements d’Informatique","Université_des_Sciences_et_de_la_Technologie_Mohamed_Boudiaf_OranFaculté_des_Mathématiques_et_de_l’Informatique"]
["U01O","Ouest","Université des Sciences et de la Technologie Mohamed Boudiaf Oran","U. STO","Faculté des Sciences de la Nature et de la Vie ","Département de Biotechnologie","Université_des_Sciences_et_de_la_Technologie_Mohamed_Boudiaf_OranFaculté_des_Sciences_de_la_Nature_et_de_la_Vie_"]
["U01O","Ouest","Université des Sciences et de la Technologie Mohamed Boudiaf Oran","U. STO","Faculté des Sciences de la Nature et de la Vie ","Département de Génétique moléculaire appliquée",{"$f":"CONCATENATE(SUBSTITUTE(C704,\" \",\"_\"),SUBSTITUTE(E704,\" \",\"_\"))","v":"Université_des_Sciences_et_de_la_Technologie_Mohamed_Boudiaf_OranFaculté_des_Sciences_de_la_Nature_et_de_la_Vie_"}]
["U01O","Ouest","Université des Sciences et de la Technologie Mohamed Boudiaf Oran","U. STO","Faculté Génie Electrique","Département d’Automatique","Université_des_Sciences_et_de_la_Technologie_Mohamed_Boudiaf_OranFaculté_Génie_Electrique"]
["U01O","Ouest","Université des Sciences et de la Technologie Mohamed Boudiaf Oran","U. STO","Faculté Génie Electrique","Département d’Electronique","Université_des_Sciences_et_de_la_Technologie_Mohamed_Boudiaf_OranFaculté_Génie_Electrique"]
["U01O","Ouest","Université des Sciences et de la Technologie Mohamed Boudiaf Oran","U. STO","Faculté Génie Electrique","Département d’Electrotechnique","Université_des_Sciences_et_de_la_Technologie_Mohamed_Boudiaf_OranFaculté_Génie_Electrique"]
["U01O","Ouest","Université des Sciences et de la Technologie Mohamed Boudiaf Oran","U. STO","Institut de Sport",null,"Université_des_Sciences_et_de_la_Technologie_Mohamed_Boudiaf_OranInstitut_de_Sport"]
["U03E","Est","Université des Sciences Islamiques Emir Abdelkader de Constantine","U. Sc. Islamiques Constantine","Faculté de Charia et de l'Economie ","Département de الفقه و أصوله","Université_des_Sciences_Islamiques_Emir_Abdelkader_de_ConstantineFaculté_de_Charia_et_de_l'Economie_"]
["U03E","Est","Université des Sciences Islamiques Emir Abdelkader de Constantine","U. Sc. Islamiques Constantine","Faculté de Charia et de l'Economie ","Département de Charia et de Droit","Université_des_Sciences_Islamiques_Emir_Abdelkader_de_ConstantineFaculté_de_Charia_et_de_l'Economie_"]
["U03E","Est","Université des Sciences Islamiques Emir Abdelkader de Constantine","U. Sc. Islamiques Constantine","Faculté de Charia et de l'Economie ","Département de l’Economie de l’Administration  ","Université_des_Sciences_Islamiques_Emir_Abdelkader_de_ConstantineFaculté_de_Charia_et_de_l'Economie_"]
["U03E","Est","Université des Sciences Islamiques Emir Abdelkader de Constantine","U. Sc. Islamiques Constantine","Faculté de Fondement de Religion ",null,"Université_des_Sciences_Islamiques_Emir_Abdelkader_de_ConstantineFaculté_de_Fondement_de_Religion_"]
["U03E","Est","Université des Sciences Islamiques Emir Abdelkader de Constantine","U. Sc. Islamiques Constantine","Faculté des Arts et de la Civilisation Islamique","Département de l’histoire","Université_des_Sciences_Islamiques_Emir_Abdelkader_de_ConstantineFaculté_des_Arts_et_de_la_Civilisation_Islamique"]
["U03E","Est","Université des Sciences Islamiques Emir Abdelkader de Constantine","U. Sc. Islamiques Constantine","Faculté des Arts et de la Civilisation Islamique","Département de la Langue Arabe","Université_des_Sciences_Islamiques_Emir_Abdelkader_de_ConstantineFaculté_des_Arts_et_de_la_Civilisation_Islamique"]
["U03E","Est","Université des Sciences Islamiques Emir Abdelkader de Constantine","U. Sc. Islamiques Constantine","Faculté des Arts et de la Civilisation Islamique","Département des Langues","Université_des_Sciences_Islamiques_Emir_Abdelkader_de_ConstantineFaculté_des_Arts_et_de_la_Civilisation_Islamique"]
["U04O","Ouest","Université El Djilali Liabès de Sidi Bel Abbès","U. Sidi Bel Abbès","Faculté de Médecine",null,"Université_El_Djilali_Liabès_de_Sidi_Bel_AbbèsFaculté_de_Médecine"]
["U04O","Ouest","Université El Djilali Liabès de Sidi Bel Abbès","U. Sidi Bel Abbès","Faculté de Technologie","Département de Génie Civil ","Université_El_Djilali_Liabès_de_Sidi_Bel_AbbèsFaculté_de_Technologie"]
["U04O","Ouest","Université El Djilali Liabès de Sidi Bel Abbès","U. Sidi Bel Abbès","Faculté de Technologie","Département de Génie Mécanique","Université_El_Djilali_Liabès_de_Sidi_Bel_AbbèsFaculté_de_Technologie"]
["U04O","Ouest","Université El Djilali Liabès de Sidi Bel Abbès","U. Sidi Bel Abbès","Faculté de Technologie","Département d'Electronique","Université_El_Djilali_Liabès_de_Sidi_Bel_AbbèsFaculté_de_Technologie"]
["U04O","Ouest","Université El Djilali Liabès de Sidi Bel Abbès","U. Sidi Bel Abbès","Faculté de Technologie","Département d'Electrotechnique ","Université_El_Djilali_Liabès_de_Sidi_Bel_AbbèsFaculté_de_Technologie"]
["U04O","Ouest","Université El Djilali Liabès de Sidi Bel Abbès","U. Sidi Bel Abbès","Faculté de Technologie","Département d'Informatique","Université_El_Djilali_Liabès_de_Sidi_Bel_AbbèsFaculté_de_Technologie"]
["U04O","Ouest","Université El Djilali Liabès de Sidi Bel Abbès","U. Sidi Bel Abbès","Faculté des Lettres et des Sciences Humaines","Département d’Histoire ","Université_El_Djilali_Liabès_de_Sidi_Bel_AbbèsFaculté_des_Lettres_et_des_Sciences_Humaines"]
["U04O","Ouest","Université El Djilali Liabès de Sidi Bel Abbès","U. Sidi Bel Abbès","Faculté des Lettres et des Sciences Humaines","Département de Philosophie ","Université_El_Djilali_Liabès_de_Sidi_Bel_AbbèsFaculté_des_Lettres_et_des_Sciences_Humaines"]
["U04O","Ouest","Université El Djilali Liabès de Sidi Bel Abbès","U. Sidi Bel Abbès","Faculté des Lettres et des Sciences Humaines","Département de Psychologie ","Université_El_Djilali_Liabès_de_Sidi_Bel_AbbèsFaculté_des_Lettres_et_des_Sciences_Humaines"]
["U04O","Ouest","Université El Djilali Liabès de Sidi Bel Abbès","U. Sidi Bel Abbès","Faculté des Lettres et des Sciences Humaines","Département de Sociologie ","Université_El_Djilali_Liabès_de_Sidi_Bel_AbbèsFaculté_des_Lettres_et_des_Sciences_Humaines"]
["U04O","Ouest","Université El Djilali Liabès de Sidi Bel Abbès","U. Sidi Bel Abbès","Faculté des Lettres et des Sciences Humaines","Département des Langues et Littératures Arabes ","Université_El_Djilali_Liabès_de_Sidi_Bel_AbbèsFaculté_des_Lettres_et_des_Sciences_Humaines"]
["U04O","Ouest","Université El Djilali Liabès de Sidi Bel Abbès","U. Sidi Bel Abbès","Faculté des Lettres et des Sciences Humaines","Département des Langues Étrangères","Université_El_Djilali_Liabès_de_Sidi_Bel_AbbèsFaculté_des_Lettres_et_des_Sciences_Humaines"]
["U04O","Ouest","Université El Djilali Liabès de Sidi Bel Abbès","U. Sidi Bel Abbès","Faculté des Lettres et des Sciences Humaines","Département des Sciences Politiques","Université_El_Djilali_Liabès_de_Sidi_Bel_AbbèsFaculté_des_Lettres_et_des_Sciences_Humaines"]
["U04O","Ouest","Université El Djilali Liabès de Sidi Bel Abbès","U. Sidi Bel Abbès","Faculté des Lettres et des Sciences Humaines","Département Interprétariat et Traduction ","Université_El_Djilali_Liabès_de_Sidi_Bel_AbbèsFaculté_des_Lettres_et_des_Sciences_Humaines"]
["U04O","Ouest","Université El Djilali Liabès de Sidi Bel Abbès","U. Sidi Bel Abbès","Faculté des Sciences","Département de Biologie","Université_El_Djilali_Liabès_de_Sidi_Bel_AbbèsFaculté_des_Sciences"]
["U04O","Ouest","Université El Djilali Liabès de Sidi Bel Abbès","U. Sidi Bel Abbès","Faculté des Sciences","Département de Chimie","Université_El_Djilali_Liabès_de_Sidi_Bel_AbbèsFaculté_des_Sciences"]
["U04O","Ouest","Université El Djilali Liabès de Sidi Bel Abbès","U. Sidi Bel Abbès","Faculté des Sciences","Département de L’environnement","Université_El_Djilali_Liabès_de_Sidi_Bel_AbbèsFaculté_des_Sciences"]
["U04O","Ouest","Université El Djilali Liabès de Sidi Bel Abbès","U. Sidi Bel Abbès","Faculté des Sciences","Département de Mathématique","Université_El_Djilali_Liabès_de_Sidi_Bel_AbbèsFaculté_des_Sciences"]
["U04O","Ouest","Université El Djilali Liabès de Sidi Bel Abbès","U. Sidi Bel Abbès","Faculté des Sciences","Département de Physique","Université_El_Djilali_Liabès_de_Sidi_Bel_AbbèsFaculté_des_Sciences"]
["U04O","Ouest","Université El Djilali Liabès de Sidi Bel Abbès","U. Sidi Bel Abbès","Faculté des Sciences Commerciales",null,"Université_El_Djilali_Liabès_de_Sidi_Bel_AbbèsFaculté_des_Sciences_Commerciales"]
["U04O","Ouest","Université El Djilali Liabès de Sidi Bel Abbès","U. Sidi Bel Abbès","Facultés de Droit et de Science Politique","Départements de Droit Privé","Université_El_Djilali_Liabès_de_Sidi_Bel_AbbèsFacultés_de_Droit_et_de_Science_Politique"]
["U04O","Ouest","Université El Djilali Liabès de Sidi Bel Abbès","U. Sidi Bel Abbès","Facultés de Droit et de Science Politique","Départements de Droit Public","Université_El_Djilali_Liabès_de_Sidi_Bel_AbbèsFacultés_de_Droit_et_de_Science_Politique"]
["U04E","Est","Université El Hadj Lakhdar de Batna","U. Batna","Faculté de Droit et des Sciences Politiques","Département de Droit","Université_El_Hadj_Lakhdar_de_BatnaFaculté_de_Droit_et_des_Sciences_Politiques"]
["U04E","Est","Université El Hadj Lakhdar de Batna","U. Batna","Faculté de Droit et des Sciences Politiques","Département des Sciences Politiques","Université_El_Hadj_Lakhdar_de_BatnaFaculté_de_Droit_et_des_Sciences_Politiques"]
["U04E","Est","Université El Hadj Lakhdar de Batna","U. Batna","Faculté de Lettres et Langues","Département d’Anglais","Université_El_Hadj_Lakhdar_de_BatnaFaculté_de_Lettres_et_Langues"]
["U04E","Est","Université El Hadj Lakhdar de Batna","U. Batna","Faculté de Lettres et Langues","Département de Français","Université_El_Hadj_Lakhdar_de_BatnaFaculté_de_Lettres_et_Langues"]
["U04E","Est","Université El Hadj Lakhdar de Batna","U. Batna","Faculté de Lettres et Langues","Département de Lettre Arabe","Université_El_Hadj_Lakhdar_de_BatnaFaculté_de_Lettres_et_Langues"]
["U04E","Est","Université El Hadj Lakhdar de Batna","U. Batna","Faculté de Médecine","Département Bibliotheque","Université_El_Hadj_Lakhdar_de_BatnaFaculté_de_Médecine"]
["U04E","Est","Université El Hadj Lakhdar de Batna","U. Batna","Faculté de Médecine","Département de Médecine","Université_El_Hadj_Lakhdar_de_BatnaFaculté_de_Médecine"]
["U04E","Est","Université El Hadj Lakhdar de Batna","U. Batna","Faculté de Médecine","Département de Pharmacie","Université_El_Hadj_Lakhdar_de_BatnaFaculté_de_Médecine"]
["U04E","Est","Université El Hadj Lakhdar de Batna","U. Batna","Faculté de Technologie","Département d’Electronique","Université_El_Hadj_Lakhdar_de_BatnaFaculté_de_Technologie"]
["U04E","Est","Université El Hadj Lakhdar de Batna","U. Batna","Faculté de Technologie","Département d’Electrotechnique","Université_El_Hadj_Lakhdar_de_BatnaFaculté_de_Technologie"]
["U04E","Est","Université El Hadj Lakhdar de Batna","U. Batna","Faculté de Technologie","Département de Génie Industriel","Université_El_Hadj_Lakhdar_de_BatnaFaculté_de_Technologie"]
["U04E","Est","Université El Hadj Lakhdar de Batna","U. Batna","Faculté de Technologie","Département de Mécanique","Université_El_Hadj_Lakhdar_de_BatnaFaculté_de_Technologie"]
["U04E","Est","Université El Hadj Lakhdar de Batna","U. Batna","Faculté de Technologie","Département de Socle Commun ST","Université_El_Hadj_Lakhdar_de_BatnaFaculté_de_Technologie"]
["U04E","Est","Université El Hadj Lakhdar de Batna","U. Batna","Faculté des Sciences","Département Bibliotheque","Université_El_Hadj_Lakhdar_de_BatnaFaculté_des_Sciences"]
["U04E","Est","Université El Hadj Lakhdar de Batna","U. Batna","Faculté des Sciences","Département d’Informatique","Université_El_Hadj_Lakhdar_de_BatnaFaculté_des_Sciences"]
["U04E","Est","Université El Hadj Lakhdar de Batna","U. Batna","Faculté des Sciences","Département des Mathématiques","Université_El_Hadj_Lakhdar_de_BatnaFaculté_des_Sciences"]
["U04E","Est","Université El Hadj Lakhdar de Batna","U. Batna","Faculté des Sciences","Département des Sciences de la Matière","Université_El_Hadj_Lakhdar_de_BatnaFaculté_des_Sciences"]
["U04E","Est","Université El Hadj Lakhdar de Batna","U. Batna","Faculté des Sciences","Département des Sciences de la Vie","Université_El_Hadj_Lakhdar_de_BatnaFaculté_des_Sciences"]
["U04E","Est","Université El Hadj Lakhdar de Batna","U. Batna","Faculté des Sciences Économiques et Sciences de Gestion","Département des Sciences Commerciales","Université_El_Hadj_Lakhdar_de_BatnaFaculté_des_Sciences_Économiques_et_Sciences_de_Gestion"]
["U04E","Est","Université El Hadj Lakhdar de Batna","U. Batna","Faculté des Sciences Économiques et Sciences de Gestion","Département des Sciences de Gestion","Université_El_Hadj_Lakhdar_de_BatnaFaculté_des_Sciences_Économiques_et_Sciences_de_Gestion"]
["U04E","Est","Université El Hadj Lakhdar de Batna","U. Batna","Faculté des Sciences Économiques et Sciences de Gestion","Département des Sciences Economiques","Université_El_Hadj_Lakhdar_de_BatnaFaculté_des_Sciences_Économiques_et_Sciences_de_Gestion"]
["U04E","Est","Université El Hadj Lakhdar de Batna","U. Batna","Faculté des Sciences Humaines, Sciences Sociales Sciences Islamiques","Département des Sciences Humaines","Université_El_Hadj_Lakhdar_de_BatnaFaculté_des_Sciences_Humaines,_Sciences_Sociales_Sciences_Islamiques"]
["U04E","Est","Université El Hadj Lakhdar de Batna","U. Batna","Faculté des Sciences Humaines, Sciences Sociales Sciences Islamiques","Département des Sciences Islamiques","Université_El_Hadj_Lakhdar_de_BatnaFaculté_des_Sciences_Humaines,_Sciences_Sociales_Sciences_Islamiques"]
["U04E","Est","Université El Hadj Lakhdar de Batna","U. Batna","Faculté des Sciences Humaines, Sciences Sociales Sciences Islamiques","Département des Sciences Sociales","Université_El_Hadj_Lakhdar_de_BatnaFaculté_des_Sciences_Humaines,_Sciences_Sociales_Sciences_Islamiques"]
["U04E","Est","Université El Hadj Lakhdar de Batna","U. Batna","Institut de Génie civil, hydraulique et Architecture","Département d’Architecture","Université_El_Hadj_Lakhdar_de_BatnaInstitut_de_Génie_civil,_hydraulique_et_Architecture"]
["U04E","Est","Université El Hadj Lakhdar de Batna","U. Batna","Institut de Génie civil, hydraulique et Architecture","Département d’Hydraulique","Université_El_Hadj_Lakhdar_de_BatnaInstitut_de_Génie_civil,_hydraulique_et_Architecture"]
["U04E","Est","Université El Hadj Lakhdar de Batna","U. Batna","Institut de Génie civil, hydraulique et Architecture","Département de Génie Civil","Université_El_Hadj_Lakhdar_de_BatnaInstitut_de_Génie_civil,_hydraulique_et_Architecture"]
["U04E","Est","Université El Hadj Lakhdar de Batna","U. Batna","Institut des Sciences et Techniques des Activités Physiques et Sportifs","Département d’Education","Université_El_Hadj_Lakhdar_de_BatnaInstitut_des_Sciences_et_Techniques_des_Activités_Physiques_et_Sportifs"]
["U04E","Est","Université El Hadj Lakhdar de Batna","U. Batna","Institut des Sciences et Techniques des Activités Physiques et Sportifs","Département d’Entrainement","Université_El_Hadj_Lakhdar_de_BatnaInstitut_des_Sciences_et_Techniques_des_Activités_Physiques_et_Sportifs"]
["U04E","Est","Université El Hadj Lakhdar de Batna","U. Batna","Institut des Sciences et Techniques des Activités Physiques et Sportifs","Département des Activités Physiques   ","Université_El_Hadj_Lakhdar_de_BatnaInstitut_des_Sciences_et_Techniques_des_Activités_Physiques_et_Sportifs"]
["U04E","Est","Université El Hadj Lakhdar de Batna","U. Batna","Institut des Sciences Vétérinaires et des Sciences Agronomiques","Département d’Agronomie",{"$f":"CONCATENATE(SUBSTITUTE(C768,\" \",\"_\"),SUBSTITUTE(E768,\" \",\"_\"))","v":"Université_El_Hadj_Lakhdar_de_BatnaInstitut_des_Sciences_Vétérinaires_et_des_Sciences_Agronomiques"}]
["U04E","Est","Université El Hadj Lakhdar de Batna","U. Batna","Institut des Sciences Vétérinaires et des Sciences Agronomiques","Département de Technologie Alimentaire","Université_El_Hadj_Lakhdar_de_BatnaInstitut_des_Sciences_Vétérinaires_et_des_Sciences_Agronomiques"]
["U04E","Est","Université El Hadj Lakhdar de Batna","U. Batna","Institut des Sciences Vétérinaires et des Sciences Agronomiques","Département des Sciences Vétérinaires","Université_El_Hadj_Lakhdar_de_BatnaInstitut_des_Sciences_Vétérinaires_et_des_Sciences_Agronomiques"]
["U04E","Est","Université El Hadj Lakhdar de Batna","U. Batna","Institut d'Hygiène et Sécurité Industrielle","Département d’Environnement","Université_El_Hadj_Lakhdar_de_BatnaInstitut_d'Hygiène_et_Sécurité_Industrielle"]
["U04E","Est","Université El Hadj Lakhdar de Batna","U. Batna","Institut d'Hygiène et Sécurité Industrielle","Département de Sécurité","Université_El_Hadj_Lakhdar_de_BatnaInstitut_d'Hygiène_et_Sécurité_Industrielle"]
["U20E","Est","Université El Oued","U. El Oued","Faculté de Droit et des Sciences Politiques","Département de Droit","Université_El_OuedFaculté_de_Droit_et_des_Sciences_Politiques"]
["U20E","Est","Université El Oued","U. El Oued","Faculté de Droit et des Sciences Politiques","Département des Sciences Politiques","Université_El_OuedFaculté_de_Droit_et_des_Sciences_Politiques"]
["U20E","Est","Université El Oued","U. El Oued","Faculté des Lettres et des Langues","Département de Langue Anglaise","Université_El_OuedFaculté_des_Lettres_et_des_Langues"]
["U20E","Est","Université El Oued","U. El Oued","Faculté des Lettres et des Langues","Département de Langue Arabe","Université_El_OuedFaculté_des_Lettres_et_des_Langues"]
["U20E","Est","Université El Oued","U. El Oued","Faculté des Lettres et des Langues","Département de langues Française","Université_El_OuedFaculté_des_Lettres_et_des_Langues"]
["U20E","Est","Université El Oued","U. El Oued","Faculté des Sciences de la Nature et de la Vie ","Département de Biologie","Université_El_OuedFaculté_des_Sciences_de_la_Nature_et_de_la_Vie_"]
["U20E","Est","Université El Oued","U. El Oued","Faculté des Sciences Economiques et Commerciales et Sciences de Gestion","Département des Sciences Commerciales","Université_El_OuedFaculté_des_Sciences_Economiques_et_Commerciales_et_Sciences_de_Gestion"]
["U20E","Est","Université El Oued","U. El Oued","Faculté des Sciences Economiques et Commerciales et Sciences de Gestion","Département des Sciences de Gestion","Université_El_OuedFaculté_des_Sciences_Economiques_et_Commerciales_et_Sciences_de_Gestion"]
["U20E","Est","Université El Oued","U. El Oued","Faculté des Sciences Economiques et Commerciales et Sciences de Gestion","Département des Sciences Economiques","Université_El_OuedFaculté_des_Sciences_Economiques_et_Commerciales_et_Sciences_de_Gestion"]
["U20E","Est","Université El Oued","U. El Oued","Faculté des Sciences et Technologie","Département des Mathématiques et Informatique","Université_El_OuedFaculté_des_Sciences_et_Technologie"]
["U20E","Est","Université El Oued","U. El Oued","Faculté des Sciences et Technologie","Département des Sciences de la matière","Université_El_OuedFaculté_des_Sciences_et_Technologie"]
["U20E","Est","Université El Oued","U. El Oued","Faculté des Sciences et Technologie","Département des Sciences et Technologie","Université_El_OuedFaculté_des_Sciences_et_Technologie"]
["U20E","Est","Université El Oued","U. El Oued","Faculté des Sciences Sociales et Humaines","Département des Sciences Humaines","Université_El_OuedFaculté_des_Sciences_Sociales_et_Humaines"]
["U20E","Est","Université El Oued","U. El Oued","Faculté des Sciences Sociales et Humaines","Département des Sciences Sociales","Université_El_OuedFaculté_des_Sciences_Sociales_et_Humaines"]
["U20E","Est","Université El Oued","U. El Oued","Faculté des Sciences Sociales et Humaines","Département des Sciences Islamiques","Université_El_OuedFaculté_des_Sciences_Sociales_et_Humaines"]
["U21E","Est","Université El Tarf","U. Tarf","Faculté de Droit et des Sciences Politiques","Département des Sciences Juridiques","Université_El_TarfFaculté_de_Droit_et_des_Sciences_Politiques"]
["U21E","Est","Université El Tarf","U. Tarf","Faculté de Droit et des Sciences Politiques","Département des Sciences Politiques","Université_El_TarfFaculté_de_Droit_et_des_Sciences_Politiques"]
["U21E","Est","Université El Tarf","U. Tarf","Faculté des Lettres et des Langues","Département d'Anglais","Université_El_TarfFaculté_des_Lettres_et_des_Langues"]
["U21E","Est","Université El Tarf","U. Tarf","Faculté des Lettres et des Langues","Département de la Langue et Littérature Arabe","Université_El_TarfFaculté_des_Lettres_et_des_Langues"]
["U21E","Est","Université El Tarf","U. Tarf","Faculté des Lettres et des Langues","Département Français ","Université_El_TarfFaculté_des_Lettres_et_des_Langues"]
["U21E","Est","Université El Tarf","U. Tarf","Faculté des Sciences de la Nature et de la Vie ",null,"Université_El_TarfFaculté_des_Sciences_de_la_Nature_et_de_la_Vie_"]
["U21E","Est","Université El Tarf","U. Tarf","Faculté des Sciences Economiques et des Sciences Commerciales et des Sciences de Gestion","Département des Sciences Commerciales","Université_El_TarfFaculté_des_Sciences_Economiques_et_des_Sciences_Commerciales_et_des_Sciences_de_Gestion"]
["U21E","Est","Université El Tarf","U. Tarf","Faculté des Sciences Economiques et des Sciences Commerciales et des Sciences de Gestion","Département des Sciences de Gestion","Université_El_TarfFaculté_des_Sciences_Economiques_et_des_Sciences_Commerciales_et_des_Sciences_de_Gestion"]
["U21E","Est","Université El Tarf","U. Tarf","Faculté des Sciences Economiques et des Sciences Commerciales et des Sciences de Gestion","Département des Sciences Economiques","Université_El_TarfFaculté_des_Sciences_Economiques_et_des_Sciences_Commerciales_et_des_Sciences_de_Gestion"]
["U21E","Est","Université El Tarf","U. Tarf","Faculté des Sciences et Technologie","Département Maths et Informatique","Université_El_TarfFaculté_des_Sciences_et_Technologie"]
["U21E","Est","Université El Tarf","U. Tarf","Faculté des Sciences Sociales et Humaines","Département des Sciences Humaines","Université_El_TarfFaculté_des_Sciences_Sociales_et_Humaines"]
["U21E","Est","Université El Tarf","U. Tarf","Faculté des Sciences Sociales et Humaines","Département des Sciences Sociales","Université_El_TarfFaculté_des_Sciences_Sociales_et_Humaines"]
["U02O","Ouest","Université Es Sénia d'Oran","U. Oran","Faculté de Droit","Département Droit Privé  ","Université_Es_Sénia_d'OranFaculté_de_Droit"]
["U02O","Ouest","Université Es Sénia d'Oran","U. Oran","Faculté de Droit","Département Droit Public  ","Université_Es_Sénia_d'OranFaculté_de_Droit"]
["U02O","Ouest","Université Es Sénia d'Oran","U. Oran","Faculté de Droit","Département Sciences Politiques et Relations Internationales","Université_Es_Sénia_d'OranFaculté_de_Droit"]
["U02O","Ouest","Université Es Sénia d'Oran","U. Oran","Faculté de Médecine",null,"Université_Es_Sénia_d'OranFaculté_de_Médecine"]
["U02O","Ouest","Université Es Sénia d'Oran","U. Oran","Faculté des Lettres et des Langues","Département de Traduction","Université_Es_Sénia_d'OranFaculté_des_Lettres_et_des_Langues"]
["U02O","Ouest","Université Es Sénia d'Oran","U. Oran","Faculté des Lettres et des Langues","Département des Arts dramatiques Langues anglo-saxonnes ","Université_Es_Sénia_d'OranFaculté_des_Lettres_et_des_Langues"]
["U02O","Ouest","Université Es Sénia d'Oran","U. Oran","Faculté des Lettres et des Langues","Département des Langues Latines","Université_Es_Sénia_d'OranFaculté_des_Lettres_et_des_Langues"]
["U02O","Ouest","Université Es Sénia d'Oran","U. Oran","Faculté des Lettres et des Langues","Département des Lettres et Langue Arabe","Université_Es_Sénia_d'OranFaculté_des_Lettres_et_des_Langues"]
["U02O","Ouest","Université Es Sénia d'Oran","U. Oran","Faculté des Sciences de la Nature et de la Vie ",null,"Université_Es_Sénia_d'OranFaculté_des_Sciences_de_la_Nature_et_de_la_Vie_"]
["U02O","Ouest","Université Es Sénia d'Oran","U. Oran","Faculté des Sciences de la Terre, de la Géographie et de l’Aménagement du Territoire","Département de Géographie","Université_Es_Sénia_d'OranFaculté_des_Sciences_de_la_Terre,_de_la_Géographie_et_de_l’Aménagement_du_Territoire"]
["U02O","Ouest","Université Es Sénia d'Oran","U. Oran","Faculté des Sciences de la Terre, de la Géographie et de l’Aménagement du Territoire","Département des Sciences de la Terre ","Université_Es_Sénia_d'OranFaculté_des_Sciences_de_la_Terre,_de_la_Géographie_et_de_l’Aménagement_du_Territoire"]
["U02O","Ouest","Université Es Sénia d'Oran","U. Oran","Faculté des Sciences de la Terre, de la Géographie et de l’Aménagement du Territoire","Département de Géographie et de l'Aménagement du Territoire ","Université_Es_Sénia_d'OranFaculté_des_Sciences_de_la_Terre,_de_la_Géographie_et_de_l’Aménagement_du_Territoire"]
["U02O","Ouest","Université Es Sénia d'Oran","U. Oran","Faculté des Sciences de la Terre, de la Géographie et de l’Aménagement du Territoire","Département de Géologie","Université_Es_Sénia_d'OranFaculté_des_Sciences_de_la_Terre,_de_la_Géographie_et_de_l’Aménagement_du_Territoire"]
["U02O","Ouest","Université Es Sénia d'Oran","U. Oran","Faculté des Sciences de la Terre, de la Géographie et de l’Aménagement du Territoire",null,"Université_Es_Sénia_d'OranFaculté_des_Sciences_de_la_Terre,_de_la_Géographie_et_de_l’Aménagement_du_Territoire"]
["U02O","Ouest","Université Es Sénia d'Oran","U. Oran","Faculté des Sciences Economiques, Commerciales et des Sciences de Gestion",null,"Université_Es_Sénia_d'OranFaculté_des_Sciences_Economiques,_Commerciales_et_des_Sciences_de_Gestion"]
["U02O","Ouest","Université Es Sénia d'Oran","U. Oran","Faculté des Sciences Exacte et Appliqué ","Département d’Informatique","Université_Es_Sénia_d'OranFaculté_des_Sciences_Exacte_et_Appliqué_"]
["U02O","Ouest","Université Es Sénia d'Oran","U. Oran","Faculté des Sciences Exacte et Appliqué ","Département de Chimie","Université_Es_Sénia_d'OranFaculté_des_Sciences_Exacte_et_Appliqué_"]
["U02O","Ouest","Université Es Sénia d'Oran","U. Oran","Faculté des Sciences Exacte et Appliqué ","Département de Physique","Université_Es_Sénia_d'OranFaculté_des_Sciences_Exacte_et_Appliqué_"]
["U02O","Ouest","Université Es Sénia d'Oran","U. Oran","Faculté des Sciences Exacte et Appliqué ","Département des Mathématiques","Université_Es_Sénia_d'OranFaculté_des_Sciences_Exacte_et_Appliqué_"]
["U02O","Ouest","Université Es Sénia d'Oran","U. Oran","Faculté des Sciences Humaines et de la Civilisation Islamique",null,"Université_Es_Sénia_d'OranFaculté_des_Sciences_Humaines_et_de_la_Civilisation_Islamique"]
["U02O","Ouest","Université Es Sénia d'Oran","U. Oran","Faculté des Sciences Sociales","Département de Démographie","Université_Es_Sénia_d'OranFaculté_des_Sciences_Sociales"]
["U02O","Ouest","Université Es Sénia d'Oran","U. Oran","Faculté des Sciences Sociales","Département de Philosophie","Université_Es_Sénia_d'OranFaculté_des_Sciences_Sociales"]
["U02O","Ouest","Université Es Sénia d'Oran","U. Oran","Faculté des Sciences Sociales","Département de Psychologie","Université_Es_Sénia_d'OranFaculté_des_Sciences_Sociales"]
["U02O","Ouest","Université Es Sénia d'Oran","U. Oran","Faculté des Sciences Sociales","Département de Sociologie","Université_Es_Sénia_d'OranFaculté_des_Sciences_Sociales"]
["U05E","Est","Université Ferhat Abbes de Sétif 1","U. Sétif-1-","Faculté d’Architecture et des Sciences de la Terre","Département Architecture","Université_Ferhat_Abbes_de_Sétif_1Faculté_d’Architecture_et_des_Sciences_de_la_Terre"]
["U05E","Est","Université Ferhat Abbes de Sétif 1","U. Sétif-1-","Faculté d’Architecture et des Sciences de la Terre","Département Sciences de la Terre          ","Université_Ferhat_Abbes_de_Sétif_1Faculté_d’Architecture_et_des_Sciences_de_la_Terre"]
["U05E","Est","Université Ferhat Abbes de Sétif 1","U. Sétif-1-","Faculté de Médecine","Département de Chirurgie Dentaire","Université_Ferhat_Abbes_de_Sétif_1Faculté_de_Médecine"]
["U05E","Est","Université Ferhat Abbes de Sétif 1","U. Sétif-1-","Faculté de Médecine","Département de Médecine","Université_Ferhat_Abbes_de_Sétif_1Faculté_de_Médecine"]
["U05E","Est","Université Ferhat Abbes de Sétif 1","U. Sétif-1-","Faculté de Médecine","Département de Pharmacie ","Université_Ferhat_Abbes_de_Sétif_1Faculté_de_Médecine"]
["U05E","Est","Université Ferhat Abbes de Sétif 1","U. Sétif-1-","Faculté de Technologie","Département d’Electronique","Université_Ferhat_Abbes_de_Sétif_1Faculté_de_Technologie"]
["U05E","Est","Université Ferhat Abbes de Sétif 1","U. Sétif-1-","Faculté de Technologie","Département d’Electrotechnique","Université_Ferhat_Abbes_de_Sétif_1Faculté_de_Technologie"]
["U05E","Est","Université Ferhat Abbes de Sétif 1","U. Sétif-1-","Faculté de Technologie","Département de Génie des procédés","Université_Ferhat_Abbes_de_Sétif_1Faculté_de_Technologie"]
["U05E","Est","Université Ferhat Abbes de Sétif 1","U. Sétif-1-","Faculté de Technologie","Département Génie Civil",{"$f":"CONCATENATE(SUBSTITUTE(C832,\" \",\"_\"),SUBSTITUTE(E832,\" \",\"_\"))","v":"Université_Ferhat_Abbes_de_Sétif_1Faculté_de_Technologie"}]
["U05E","Est","Université Ferhat Abbes de Sétif 1","U. Sétif-1-","Faculté des Sciences","Département de Chimie","Université_Ferhat_Abbes_de_Sétif_1Faculté_des_Sciences"]
["U05E","Est","Université Ferhat Abbes de Sétif 1","U. Sétif-1-","Faculté des Sciences","Département de Mathématiques","Université_Ferhat_Abbes_de_Sétif_1Faculté_des_Sciences"]
["U05E","Est","Université Ferhat Abbes de Sétif 1","U. Sétif-1-","Faculté des Sciences","Département de Physique","Université_Ferhat_Abbes_de_Sétif_1Faculté_des_Sciences"]
["U05E","Est","Université Ferhat Abbes de Sétif 1","U. Sétif-1-","Faculté des Sciences","Département d'Informatique","Université_Ferhat_Abbes_de_Sétif_1Faculté_des_Sciences"]
["U05E","Est","Université Ferhat Abbes de Sétif 1","U. Sétif-1-","Faculté des Sciences de la Nature et de la Vie ","Département de Biochimie","Université_Ferhat_Abbes_de_Sétif_1Faculté_des_Sciences_de_la_Nature_et_de_la_Vie_"]
["U05E","Est","Université Ferhat Abbes de Sétif 1","U. Sétif-1-","Faculté des Sciences de la Nature et de la Vie ","Département de Biologie et Ecologie Végétale","Université_Ferhat_Abbes_de_Sétif_1Faculté_des_Sciences_de_la_Nature_et_de_la_Vie_"]
["U05E","Est","Université Ferhat Abbes de Sétif 1","U. Sétif-1-","Faculté des Sciences de la Nature et de la Vie ","Département de Biologie et Physiologie Animale","Université_Ferhat_Abbes_de_Sétif_1Faculté_des_Sciences_de_la_Nature_et_de_la_Vie_"]
["U05E","Est","Université Ferhat Abbes de Sétif 1","U. Sétif-1-","Faculté des Sciences de la Nature et de la Vie ","Département des Sciences Agronomique","Université_Ferhat_Abbes_de_Sétif_1Faculté_des_Sciences_de_la_Nature_et_de_la_Vie_"]
["U05E","Est","Université Ferhat Abbes de Sétif 1","U. Sétif-1-","Faculté des Sciences Economiques et Commerciales et Sciences de Gestion","Département des Sciences Commerciales","Université_Ferhat_Abbes_de_Sétif_1Faculté_des_Sciences_Economiques_et_Commerciales_et_Sciences_de_Gestion"]
["U05E","Est","Université Ferhat Abbes de Sétif 1","U. Sétif-1-","Faculté des Sciences Economiques et Commerciales et Sciences de Gestion","Département des Sciences de Gestion","Université_Ferhat_Abbes_de_Sétif_1Faculté_des_Sciences_Economiques_et_Commerciales_et_Sciences_de_Gestion"]
["U05E","Est","Université Ferhat Abbes de Sétif 1","U. Sétif-1-","Faculté des Sciences Economiques et Commerciales et Sciences de Gestion","Département des Sciences Economiques","Université_Ferhat_Abbes_de_Sétif_1Faculté_des_Sciences_Economiques_et_Commerciales_et_Sciences_de_Gestion"]
["U05E","Est","Université Ferhat Abbes de Sétif 1","U. Sétif-1-","Institut d’Optique et Mécanique de Précision","Département d’Optique","Université_Ferhat_Abbes_de_Sétif_1Institut_d’Optique_et_Mécanique_de_Précision"]
["U05E","Est","Université Ferhat Abbes de Sétif 1","U. Sétif-1-","Institut d’Optique et Mécanique de Précision","Département de Mécanique de précision","Université_Ferhat_Abbes_de_Sétif_1Institut_d’Optique_et_Mécanique_de_Précision"]
["U08C","Centre","Université Hassiba Ben Bouali de Chlef","U. Chlef","Faculté de Droit et des Sciences Politiques","Département de Droit Privé","Université_Hassiba_Ben_Bouali_de_ChlefFaculté_de_Droit_et_des_Sciences_Politiques"]
["U08C","Centre","Université Hassiba Ben Bouali de Chlef","U. Chlef","Faculté de Droit et des Sciences Politiques","Département de Droit Public","Université_Hassiba_Ben_Bouali_de_ChlefFaculté_de_Droit_et_des_Sciences_Politiques"]
["U08C","Centre","Université Hassiba Ben Bouali de Chlef","U. Chlef","Faculté de Droit et des Sciences Politiques","Département de Sciences Politiques","Université_Hassiba_Ben_Bouali_de_ChlefFaculté_de_Droit_et_des_Sciences_Politiques"]
["U08C","Centre","Université Hassiba Ben Bouali de Chlef","U. Chlef","Faculté de Génie Civil et d'Architecture ","Département d'Architecture","Université_Hassiba_Ben_Bouali_de_ChlefFaculté_de_Génie_Civil_et_d'Architecture "]
["U08C","Centre","Université Hassiba Ben Bouali de Chlef","U. Chlef","Faculté de Génie Civil et d'Architecture ","Département de Génie Civil","Université_Hassiba_Ben_Bouali_de_ChlefFaculté_de_Génie_Civil_et_d'Architecture "]
["U08C","Centre","Université Hassiba Ben Bouali de Chlef","U. Chlef","Faculté de Génie Civil et d'Architecture ","Département d'Hydraulique","Université_Hassiba_Ben_Bouali_de_ChlefFaculté_de_Génie_Civil_et_d'Architecture "]
["U08C","Centre","Université Hassiba Ben Bouali de Chlef","U. Chlef","Faculté de Technologie","Département de Génie des Procédés","Université_Hassiba_Ben_Bouali_de_ChlefFaculté_de_Technologie"]
["U08C","Centre","Université Hassiba Ben Bouali de Chlef","U. Chlef","Faculté de Technologie","Département de Génie Mécanique","Université_Hassiba_Ben_Bouali_de_ChlefFaculté_de_Technologie"]
["U08C","Centre","Université Hassiba Ben Bouali de Chlef","U. Chlef","Faculté de Technologie","Département d'Electronique","Université_Hassiba_Ben_Bouali_de_ChlefFaculté_de_Technologie"]
["U08C","Centre","Université Hassiba Ben Bouali de Chlef","U. Chlef","Faculté de Technologie","Département d'Electrotechnique","Université_Hassiba_Ben_Bouali_de_ChlefFaculté_de_Technologie"]
["U08C","Centre","Université Hassiba Ben Bouali de Chlef","U. Chlef","Faculté des Lettres et des Langues","Département de la Langue Anglaise","Université_Hassiba_Ben_Bouali_de_ChlefFaculté_des_Lettres_et_des_Langues"]
["U08C","Centre","Université Hassiba Ben Bouali de Chlef","U. Chlef","Faculté des Lettres et des Langues","Département de la Langue Française","Université_Hassiba_Ben_Bouali_de_ChlefFaculté_des_Lettres_et_des_Langues"]
["U08C","Centre","Université Hassiba Ben Bouali de Chlef","U. Chlef","Faculté des Lettres et des Langues","Département de Lettre Arabe","Université_Hassiba_Ben_Bouali_de_ChlefFaculté_des_Lettres_et_des_Langues"]
["U08C","Centre","Université Hassiba Ben Bouali de Chlef","U. Chlef","Faculté des Sciences","Département de Biologie","Université_Hassiba_Ben_Bouali_de_ChlefFaculté_des_Sciences"]
["U08C","Centre","Université Hassiba Ben Bouali de Chlef","U. Chlef","Faculté des Sciences","Département de Chimie","Université_Hassiba_Ben_Bouali_de_ChlefFaculté_des_Sciences"]
["U08C","Centre","Université Hassiba Ben Bouali de Chlef","U. Chlef","Faculté des Sciences","Département de Mathématique","Université_Hassiba_Ben_Bouali_de_ChlefFaculté_des_Sciences"]
["U08C","Centre","Université Hassiba Ben Bouali de Chlef","U. Chlef","Faculté des Sciences","Département de Physique","Université_Hassiba_Ben_Bouali_de_ChlefFaculté_des_Sciences"]
["U08C","Centre","Université Hassiba Ben Bouali de Chlef","U. Chlef","Faculté des Sciences","Département d'Informatique","Université_Hassiba_Ben_Bouali_de_ChlefFaculté_des_Sciences"]
["U08C","Centre","Université Hassiba Ben Bouali de Chlef","U. Chlef","Faculté des Sciences Economiques, Commerciales et des Sciences de Gestion","Département de Sciences Commerciales","Université_Hassiba_Ben_Bouali_de_ChlefFaculté_des_Sciences_Economiques,_Commerciales_et_des_Sciences_de_Gestion"]
["U08C","Centre","Université Hassiba Ben Bouali de Chlef","U. Chlef","Faculté des Sciences Economiques, Commerciales et des Sciences de Gestion","Département de Sciences de Gestion","Université_Hassiba_Ben_Bouali_de_ChlefFaculté_des_Sciences_Economiques,_Commerciales_et_des_Sciences_de_Gestion"]
["U08C","Centre","Université Hassiba Ben Bouali de Chlef","U. Chlef","Faculté des Sciences Economiques, Commerciales et des Sciences de Gestion","Département de Sciences Economiques","Université_Hassiba_Ben_Bouali_de_ChlefFaculté_des_Sciences_Economiques,_Commerciales_et_des_Sciences_de_Gestion"]
["U08C","Centre","Université Hassiba Ben Bouali de Chlef","U. Chlef","Faculté des Sciences Humaines et Sciences Sociales ","Département de Sciences Humaines","Université_Hassiba_Ben_Bouali_de_ChlefFaculté_des_Sciences_Humaines_et_Sciences_Sociales "]
["U08C","Centre","Université Hassiba Ben Bouali de Chlef","U. Chlef","Faculté des Sciences Humaines et Sciences Sociales ","Département de Sciences Sociales","Université_Hassiba_Ben_Bouali_de_ChlefFaculté_des_Sciences_Humaines_et_Sciences_Sociales "]
["U08C","Centre","Université Hassiba Ben Bouali de Chlef","U. Chlef","Institut d'Education Physique et Sportive ","Département de Management du Sport","Université_Hassiba_Ben_Bouali_de_ChlefInstitut_d'Education_Physique_et_Sportive "]
["U08C","Centre","Université Hassiba Ben Bouali de Chlef","U. Chlef","Institut d'Education Physique et Sportive ","Département d'Education Physique et Sportive","Université_Hassiba_Ben_Bouali_de_ChlefInstitut_d'Education_Physique_et_Sportive "]
["U08C","Centre","Université Hassiba Ben Bouali de Chlef","U. Chlef","Institut d'Education Physique et Sportive ","Département d'Entraînement Sportif","Université_Hassiba_Ben_Bouali_de_ChlefInstitut_d'Education_Physique_et_Sportive "]
["U08C","Centre","Université Hassiba Ben Bouali de Chlef","U. Chlef","Institut des Sciences Agronomiques ","Département de Phyrotechnie","Université_Hassiba_Ben_Bouali_de_ChlefInstitut_des_Sciences_Agronomiques "]
["U08C","Centre","Université Hassiba Ben Bouali de Chlef","U. Chlef","Institut des Sciences Agronomiques ","Département d'Hydraulique Agricole","Université_Hassiba_Ben_Bouali_de_ChlefInstitut_des_Sciences_Agronomiques "]
["U07O","Ouest","Université Ibn Khaldoun de Tiaret","U. Tiaret","Faculté de Droit et des Sciences Politiques","Département de Droit ","Université_Ibn_Khaldoun_de_TiaretFaculté_de_Droit_et_des_Sciences_Politiques"]
["U07O","Ouest","Université Ibn Khaldoun de Tiaret","U. Tiaret","Faculté de Droit et des Sciences Politiques","Département des Sciences Politiques","Université_Ibn_Khaldoun_de_TiaretFaculté_de_Droit_et_des_Sciences_Politiques"]
["U07O","Ouest","Université Ibn Khaldoun de Tiaret","U. Tiaret","Faculté des Lettres et des Langues",null,"Université_Ibn_Khaldoun_de_TiaretFaculté_des_Lettres_et_des_Langues"]
["U07O","Ouest","Université Ibn Khaldoun de Tiaret","U. Tiaret","Faculté des Mathématiques et de l’Informatique","Département d’Informatique","Université_Ibn_Khaldoun_de_TiaretFaculté_des_Mathématiques_et_de_l’Informatique"]
["U07O","Ouest","Université Ibn Khaldoun de Tiaret","U. Tiaret","Faculté des Mathématiques et de l’Informatique","Département des Mathématiques","Université_Ibn_Khaldoun_de_TiaretFaculté_des_Mathématiques_et_de_l’Informatique"]
["U07O","Ouest","Université Ibn Khaldoun de Tiaret","U. Tiaret","Faculté des Sciences Appliquées","Département Génie Civil","Université_Ibn_Khaldoun_de_TiaretFaculté_des_Sciences_Appliquées"]
["U07O","Ouest","Université Ibn Khaldoun de Tiaret","U. Tiaret","Faculté des Sciences Appliquées","Département Génie Electrique","Université_Ibn_Khaldoun_de_TiaretFaculté_des_Sciences_Appliquées"]
["U07O","Ouest","Université Ibn Khaldoun de Tiaret","U. Tiaret","Faculté des Sciences Appliquées","Département Génie Mécanique","Université_Ibn_Khaldoun_de_TiaretFaculté_des_Sciences_Appliquées"]
["U07O","Ouest","Université Ibn Khaldoun de Tiaret","U. Tiaret","Faculté des Sciences Appliquées","Département Sciences et Technologies","Université_Ibn_Khaldoun_de_TiaretFaculté_des_Sciences_Appliquées"]
["U07O","Ouest","Université Ibn Khaldoun de Tiaret","U. Tiaret","Faculté des Sciences de la Matière","Département de Chimie","Université_Ibn_Khaldoun_de_TiaretFaculté_des_Sciences_de_la_Matière"]
["U07O","Ouest","Université Ibn Khaldoun de Tiaret","U. Tiaret","Faculté des Sciences de la Matière","Département de Physique","Université_Ibn_Khaldoun_de_TiaretFaculté_des_Sciences_de_la_Matière"]
["U07O","Ouest","Université Ibn Khaldoun de Tiaret","U. Tiaret","Faculté des Sciences de la Nature et de la Vie ","Département de Nutrition et système classique","Université_Ibn_Khaldoun_de_TiaretFaculté_des_Sciences_de_la_Nature_et_de_la_Vie_"]
["U07O","Ouest","Université Ibn Khaldoun de Tiaret","U. Tiaret","Faculté des Sciences de la Nature et de la Vie ","Département des Science de la Nature et de la Vie","Université_Ibn_Khaldoun_de_TiaretFaculté_des_Sciences_de_la_Nature_et_de_la_Vie_"]
["U07O","Ouest","Université Ibn Khaldoun de Tiaret","U. Tiaret","Faculté des Sciences de la Nature et de la Vie ","Département Science de la terre, de l'univers et de l'environnement","Université_Ibn_Khaldoun_de_TiaretFaculté_des_Sciences_de_la_Nature_et_de_la_Vie_"]
["U07O","Ouest","Université Ibn Khaldoun de Tiaret","U. Tiaret","Faculté des Sciences Economiques des Sciences Commerciales et des Sciences de Gestion","Département des Sciences Commerciales","Université_Ibn_Khaldoun_de_TiaretFaculté_des_Sciences_Economiques_des_Sciences_Commerciales_et_des_Sciences_de_Gestion"]
["U07O","Ouest","Université Ibn Khaldoun de Tiaret","U. Tiaret","Faculté des Sciences Economiques des Sciences Commerciales et des Sciences de Gestion","Département des Sciences de Gestion","Université_Ibn_Khaldoun_de_TiaretFaculté_des_Sciences_Economiques_des_Sciences_Commerciales_et_des_Sciences_de_Gestion"]
["U07O","Ouest","Université Ibn Khaldoun de Tiaret","U. Tiaret","Faculté des Sciences Economiques des Sciences Commerciales et des Sciences de Gestion","Département des Sciences Economiques","Université_Ibn_Khaldoun_de_TiaretFaculté_des_Sciences_Economiques_des_Sciences_Commerciales_et_des_Sciences_de_Gestion"]
["U07O","Ouest","Université Ibn Khaldoun de Tiaret","U. Tiaret","Faculté des Sciences Humaines et Sociales",null,"Université_Ibn_Khaldoun_de_TiaretFaculté_des_Sciences_Humaines_et_Sociales"]
["U07O","Ouest","Université Ibn Khaldoun de Tiaret","U. Tiaret","Institut de Technologie",null,"Université_Ibn_Khaldoun_de_TiaretInstitut_de_Technologie"]
["U07O","Ouest","Université Ibn Khaldoun de Tiaret","U. Tiaret","Institut des Sciences Vétérinaires","Département de Biomédecine.","Université_Ibn_Khaldoun_de_TiaretInstitut_des_Sciences_Vétérinaires"]
["U07O","Ouest","Université Ibn Khaldoun de Tiaret","U. Tiaret","Institut des Sciences Vétérinaires","Département de Santé Animale","Université_Ibn_Khaldoun_de_TiaretInstitut_des_Sciences_Vétérinaires"]
["U07E","Est","Université Kasdi Merbah de Ouargla","U. Ouargla","Faculté de Medecine",null,"Université_Kasdi_Merbah_de_OuarglaFaculté_de_Medecine"]
["U07E","Est","Université Kasdi Merbah de Ouargla","U. Ouargla","Faculté des Hydrocarbures, des Energies Renouvelables, des Sciences de la Terre et de l’Univers","Département d’Energies Renouvelables ",{"$f":"CONCATENATE(SUBSTITUTE(C896,\" \",\"_\"),SUBSTITUTE(E896,\" \",\"_\"))","v":"Université_Kasdi_Merbah_de_OuarglaFaculté_des_Hydrocarbures,_des_Energies_Renouvelables,_des_Sciences_de_la_Terre_et_de_l’Univers"}]
["U07E","Est","Université Kasdi Merbah de Ouargla","U. Ouargla","Faculté des Hydrocarbures, des Energies Renouvelables, des Sciences de la Terre et de l’Univers","Département de l'exploration et de la mécanique des ateliers de pétrole","Université_Kasdi_Merbah_de_OuarglaFaculté_des_Hydrocarbures,_des_Energies_Renouvelables,_des_Sciences_de_la_Terre_et_de_l’Univers"]
["U07E","Est","Université Kasdi Merbah de Ouargla","U. Ouargla","Faculté des Hydrocarbures, des Energies Renouvelables, des Sciences de la Terre et de l’Univers","Département de Production d'Hydrocarbures ","Université_Kasdi_Merbah_de_OuarglaFaculté_des_Hydrocarbures,_des_Energies_Renouvelables,_des_Sciences_de_la_Terre_et_de_l’Univers"]
["U07E","Est","Université Kasdi Merbah de Ouargla","U. Ouargla","Faculté des Hydrocarbures, des Energies Renouvelables, des Sciences de la Terre et de l’Univers","Département des Sciences de la Terre et de l'univers ","Université_Kasdi_Merbah_de_OuarglaFaculté_des_Hydrocarbures,_des_Energies_Renouvelables,_des_Sciences_de_la_Terre_et_de_l’Univers"]
["U07E","Est","Université Kasdi Merbah de Ouargla","U. Ouargla","Faculté des Lettres et des Langues","Département des Lettres et Langues Arabe","Université_Kasdi_Merbah_de_OuarglaFaculté_des_Lettres_et_des_Langues"]
["U07E","Est","Université Kasdi Merbah de Ouargla","U. Ouargla","Faculté des Lettres et des Langues","Département Lettres et Langue Anglaise","Université_Kasdi_Merbah_de_OuarglaFaculté_des_Lettres_et_des_Langues"]
["U07E","Est","Université Kasdi Merbah de Ouargla","U. Ouargla","Faculté des Lettres et des Langues","Département Lettres et Langue Française","Université_Kasdi_Merbah_de_OuarglaFaculté_des_Lettres_et_des_Langues"]
["U07E","Est","Université Kasdi Merbah de Ouargla","U. Ouargla","Faculté des Mathématiques et des Sciences de la Matière","Département de Chimie","Université_Kasdi_Merbah_de_OuarglaFaculté_des_Mathématiques_et_des_Sciences_de_la_Matière"]
["U07E","Est","Université Kasdi Merbah de Ouargla","U. Ouargla","Faculté des Mathématiques et des Sciences de la Matière","Département de Physique","Université_Kasdi_Merbah_de_OuarglaFaculté_des_Mathématiques_et_des_Sciences_de_la_Matière"]
["U07E","Est","Université Kasdi Merbah de Ouargla","U. Ouargla","Faculté des Mathématiques et des Sciences de la Matière","Département des Mathématiques","Université_Kasdi_Merbah_de_OuarglaFaculté_des_Mathématiques_et_des_Sciences_de_la_Matière"]
["U07E","Est","Université Kasdi Merbah de Ouargla","U. Ouargla","Faculté des Nouvelles Technologies de l’Information et de la Communication","Département de Communication","Université_Kasdi_Merbah_de_OuarglaFaculté_des_Nouvelles_Technologies_de_l’Information_et_de_la_Communication"]
["U07E","Est","Université Kasdi Merbah de Ouargla","U. Ouargla","Faculté des Nouvelles Technologies de l’Information et de la Communication","Département de Technologie de l’Information","Université_Kasdi_Merbah_de_OuarglaFaculté_des_Nouvelles_Technologies_de_l’Information_et_de_la_Communication"]
["U07E","Est","Université Kasdi Merbah de Ouargla","U. Ouargla","Faculté des Sciences Appliquées","Département de Génie Civil et de l'Irrigation ","Université_Kasdi_Merbah_de_OuarglaFaculté_des_Sciences_Appliquées"]
["U07E","Est","Université Kasdi Merbah de Ouargla","U. Ouargla","Faculté des Sciences Appliquées","Département de Génie Electrique","Université_Kasdi_Merbah_de_OuarglaFaculté_des_Sciences_Appliquées"]
["U07E","Est","Université Kasdi Merbah de Ouargla","U. Ouargla","Faculté des Sciences Appliquées","Département de génie mécanique ","Université_Kasdi_Merbah_de_OuarglaFaculté_des_Sciences_Appliquées"]
["U07E","Est","Université Kasdi Merbah de Ouargla","U. Ouargla","Faculté des Sciences Appliquées","Département des Méthodes d'Ingénierie ","Université_Kasdi_Merbah_de_OuarglaFaculté_des_Sciences_Appliquées"]
["U07E","Est","Université Kasdi Merbah de Ouargla","U. Ouargla","Faculté des Sciences de la Nature et de la Vie ","Département des Sciences Agronomiques","Université_Kasdi_Merbah_de_OuarglaFaculté_des_Sciences_de_la_Nature_et_de_la_Vie_"]
["U07E","Est","Université Kasdi Merbah de Ouargla","U. Ouargla","Faculté des Sciences de la Nature et de la Vie ","Département des Sciences Biologiques","Université_Kasdi_Merbah_de_OuarglaFaculté_des_Sciences_de_la_Nature_et_de_la_Vie_"]
["U07E","Est","Université Kasdi Merbah de Ouargla","U. Ouargla","Faculté des Sciences Économiques, des Sciences Commerciales et des Sciences de Gestion","Département des Sciences Commerciales","Université_Kasdi_Merbah_de_OuarglaFaculté_des_Sciences_Économiques,_des_Sciences_Commerciales_et_des_Sciences_de_Gestion"]
["U07E","Est","Université Kasdi Merbah de Ouargla","U. Ouargla","Faculté des Sciences Économiques, des Sciences Commerciales et des Sciences de Gestion","Département des Sciences de Gestion","Université_Kasdi_Merbah_de_OuarglaFaculté_des_Sciences_Économiques,_des_Sciences_Commerciales_et_des_Sciences_de_Gestion"]
["U07E","Est","Université Kasdi Merbah de Ouargla","U. Ouargla","Faculté des Sciences Économiques, des Sciences Commerciales et des Sciences de Gestion","Département des Sciences Economiques","Université_Kasdi_Merbah_de_OuarglaFaculté_des_Sciences_Économiques,_des_Sciences_Commerciales_et_des_Sciences_de_Gestion"]
["U07E","Est","Université Kasdi Merbah de Ouargla","U. Ouargla","Faculté des Sciences Humaines et Sociales","Département de Psychologie et de l’Education ","Université_Kasdi_Merbah_de_OuarglaFaculté_des_Sciences_Humaines_et_Sociales"]
["U07E","Est","Université Kasdi Merbah de Ouargla","U. Ouargla","Faculté des Sciences Humaines et Sociales","Département de Sociologie et Démographie","Université_Kasdi_Merbah_de_OuarglaFaculté_des_Sciences_Humaines_et_Sociales"]
["U07E","Est","Université Kasdi Merbah de Ouargla","U. Ouargla","Faculté des Sciences Humaines et Sociales","Département des Science de l’information et de la Communication ","Université_Kasdi_Merbah_de_OuarglaFaculté_des_Sciences_Humaines_et_Sociales"]
["U07E","Est","Université Kasdi Merbah de Ouargla","U. Ouargla","Faculté des Sciences Humaines et Sociales","Département des Sciences Humaines","Université_Kasdi_Merbah_de_OuarglaFaculté_des_Sciences_Humaines_et_Sociales"]
["U07E","Est","Université Kasdi Merbah de Ouargla","U. Ouargla","Faculté Droit et Sciences Politiques","Département de Droit","Université_Kasdi_Merbah_de_OuarglaFaculté_Droit_et_Sciences_Politiques"]
["U07E","Est","Université Kasdi Merbah de Ouargla","U. Ouargla","Faculté Droit et Sciences Politiques","Département des Sciences Politiques","Université_Kasdi_Merbah_de_OuarglaFaculté_Droit_et_Sciences_Politiques"]
["U07E","Est","Université Kasdi Merbah de Ouargla","U. Ouargla","Institut de Technologie",null,"Université_Kasdi_Merbah_de_OuarglaInstitut_de_Technologie"]
["U07E","Est","Université Kasdi Merbah de Ouargla","U. Ouargla","Institut des Sciences et Techniques des Activités Physiques et Sportifs","Département des Sciences et Techniques des Activités Physiques et Sportives","Université_Kasdi_Merbah_de_OuarglaInstitut_des_Sciences_et_Techniques_des_Activités_Physiques_et_Sportifs"]
["U13E","Est","Université Larbi Ben Mhidi de Oum El Bouaghi","U. Oum El Bouaghi","Faculté de Droit et des Sciences Politiques","Département de Droit","Université_Larbi_Ben_Mhidi_de_Oum_El_BouaghiFaculté_de_Droit_et_des_Sciences_Politiques"]
["U13E","Est","Université Larbi Ben Mhidi de Oum El Bouaghi","U. Oum El Bouaghi","Faculté de Droit et des Sciences Politiques","Département des Sciences Politiques","Université_Larbi_Ben_Mhidi_de_Oum_El_BouaghiFaculté_de_Droit_et_des_Sciences_Politiques"]
["U13E","Est","Université Larbi Ben Mhidi de Oum El Bouaghi","U. Oum El Bouaghi","Faculté des Lettres et des Langues","Département de Langue Anglaise","Université_Larbi_Ben_Mhidi_de_Oum_El_BouaghiFaculté_des_Lettres_et_des_Langues"]
["U13E","Est","Université Larbi Ben Mhidi de Oum El Bouaghi","U. Oum El Bouaghi","Faculté des Lettres et des Langues","Département de Langue et Littérature Arabe","Université_Larbi_Ben_Mhidi_de_Oum_El_BouaghiFaculté_des_Lettres_et_des_Langues"]
["U13E","Est","Université Larbi Ben Mhidi de Oum El Bouaghi","U. Oum El Bouaghi","Faculté des Lettres et des Langues","Département de langues Française","Université_Larbi_Ben_Mhidi_de_Oum_El_BouaghiFaculté_des_Lettres_et_des_Langues"]
["U13E","Est","Université Larbi Ben Mhidi de Oum El Bouaghi","U. Oum El Bouaghi","Faculté des Sciences de la Terre et d'Architecture","Département d’Architecture","Université_Larbi_Ben_Mhidi_de_Oum_El_BouaghiFaculté_des_Sciences_de_la_Terre_et_d'Architecture"]
["U13E","Est","Université Larbi Ben Mhidi de Oum El Bouaghi","U. Oum El Bouaghi","Faculté des Sciences de la Terre et d'Architecture","Département de Géologie","Université_Larbi_Ben_Mhidi_de_Oum_El_BouaghiFaculté_des_Sciences_de_la_Terre_et_d'Architecture"]
["U13E","Est","Université Larbi Ben Mhidi de Oum El Bouaghi","U. Oum El Bouaghi","Faculté des Sciences de la Terre et d'Architecture","Département des Sciences de la Terre et de l’Univers","Université_Larbi_Ben_Mhidi_de_Oum_El_BouaghiFaculté_des_Sciences_de_la_Terre_et_d'Architecture"]
["U13E","Est","Université Larbi Ben Mhidi de Oum El Bouaghi","U. Oum El Bouaghi","Faculté des Sciences Economiques et Commerciales et Sciences de Gestion","Département des Sciences Commerciales","Université_Larbi_Ben_Mhidi_de_Oum_El_BouaghiFaculté_des_Sciences_Economiques_et_Commerciales_et_Sciences_de_Gestion"]
["U13E","Est","Université Larbi Ben Mhidi de Oum El Bouaghi","U. Oum El Bouaghi","Faculté des Sciences Economiques et Commerciales et Sciences de Gestion","Département des Sciences de Gestion","Université_Larbi_Ben_Mhidi_de_Oum_El_BouaghiFaculté_des_Sciences_Economiques_et_Commerciales_et_Sciences_de_Gestion"]
["U13E","Est","Université Larbi Ben Mhidi de Oum El Bouaghi","U. Oum El Bouaghi","Faculté des Sciences Economiques et Commerciales et Sciences de Gestion","Département des Sciences Economiques","Université_Larbi_Ben_Mhidi_de_Oum_El_BouaghiFaculté_des_Sciences_Economiques_et_Commerciales_et_Sciences_de_Gestion"]
["U13E","Est","Université Larbi Ben Mhidi de Oum El Bouaghi","U. Oum El Bouaghi","Faculté des sciences et des sciences appliquées","Département d’Hydraulique","Université_Larbi_Ben_Mhidi_de_Oum_El_BouaghiFaculté_des_sciences_et_des_sciences_appliquées"]
["U13E","Est","Université Larbi Ben Mhidi de Oum El Bouaghi","U. Oum El Bouaghi","Faculté des sciences et des sciences appliquées","Département de Génie Civil","Université_Larbi_Ben_Mhidi_de_Oum_El_BouaghiFaculté_des_sciences_et_des_sciences_appliquées"]
["U13E","Est","Université Larbi Ben Mhidi de Oum El Bouaghi","U. Oum El Bouaghi","Faculté des sciences et des sciences appliquées","Département de Génie des Procédés","Université_Larbi_Ben_Mhidi_de_Oum_El_BouaghiFaculté_des_sciences_et_des_sciences_appliquées"]
["U13E","Est","Université Larbi Ben Mhidi de Oum El Bouaghi","U. Oum El Bouaghi","Faculté des sciences et des sciences appliquées","Département de Génie Electrique","Université_Larbi_Ben_Mhidi_de_Oum_El_BouaghiFaculté_des_sciences_et_des_sciences_appliquées"]
["U13E","Est","Université Larbi Ben Mhidi de Oum El Bouaghi","U. Oum El Bouaghi","Faculté des sciences et des sciences appliquées","Département de Génie Mécanique","Université_Larbi_Ben_Mhidi_de_Oum_El_BouaghiFaculté_des_sciences_et_des_sciences_appliquées"]
["U13E","Est","Université Larbi Ben Mhidi de Oum El Bouaghi","U. Oum El Bouaghi","Faculté des sciences et des sciences appliquées","Département des Sciences et Technologie","Université_Larbi_Ben_Mhidi_de_Oum_El_BouaghiFaculté_des_sciences_et_des_sciences_appliquées"]
["U13E","Est","Université Larbi Ben Mhidi de Oum El Bouaghi","U. Oum El Bouaghi","Faculté des Sciences Exactes et Sciences de la Nature et de la Vie","Département des Mathématiques et Informatique","Université_Larbi_Ben_Mhidi_de_Oum_El_BouaghiFaculté_des_Sciences_Exactes_et_Sciences_de_la_Nature_et_de_la_Vie"]
["U13E","Est","Université Larbi Ben Mhidi de Oum El Bouaghi","U. Oum El Bouaghi","Faculté des Sciences Exactes et Sciences de la Nature et de la Vie","Département des Sciences de la Matière","Université_Larbi_Ben_Mhidi_de_Oum_El_BouaghiFaculté_des_Sciences_Exactes_et_Sciences_de_la_Nature_et_de_la_Vie"]
["U13E","Est","Université Larbi Ben Mhidi de Oum El Bouaghi","U. Oum El Bouaghi","Faculté des Sciences Exactes et Sciences de la Nature et de la Vie","Département des Sciences de la Nature et de la Vie","Université_Larbi_Ben_Mhidi_de_Oum_El_BouaghiFaculté_des_Sciences_Exactes_et_Sciences_de_la_Nature_et_de_la_Vie"]
["U13E","Est","Université Larbi Ben Mhidi de Oum El Bouaghi","U. Oum El Bouaghi","Faculté des Sciences Sociales et Humaines","Département des Sciences Humaines","Université_Larbi_Ben_Mhidi_de_Oum_El_BouaghiFaculté_des_Sciences_Sociales_et_Humaines"]
["U13E","Est","Université Larbi Ben Mhidi de Oum El Bouaghi","U. Oum El Bouaghi","Faculté des Sciences Sociales et Humaines","Département des Sciences Sociales","Université_Larbi_Ben_Mhidi_de_Oum_El_BouaghiFaculté_des_Sciences_Sociales_et_Humaines"]
["U13E","Est","Université Larbi Ben Mhidi de Oum El Bouaghi","U. Oum El Bouaghi","Institut de gestion des techniques urbaines","Département de Gestion des Techniques Urbaines","Université_Larbi_Ben_Mhidi_de_Oum_El_BouaghiInstitut_de_gestion_des_techniques_urbaines"]
["U13E","Est","Université Larbi Ben Mhidi de Oum El Bouaghi","U. Oum El Bouaghi","Institut des Sciences et Techniques des Activités Physiques et Sportifs","Département de L’Education Physique et Sportive","Université_Larbi_Ben_Mhidi_de_Oum_El_BouaghiInstitut_des_Sciences_et_Techniques_des_Activités_Physiques_et_Sportifs"]
["U14E","Est","Université Larbi Tebessi de Tébessa","U. Tébessa","Faculté de Droit et des Sciences Politiques","Département de Droit","Université_Larbi_Tebessi_de_TébessaFaculté_de_Droit_et_des_Sciences_Politiques"]
["U14E","Est","Université Larbi Tebessi de Tébessa","U. Tébessa","Faculté de Droit et des Sciences Politiques","Département de Sciences Politiques","Université_Larbi_Tebessi_de_TébessaFaculté_de_Droit_et_des_Sciences_Politiques"]
["U14E","Est","Université Larbi Tebessi de Tébessa","U. Tébessa","Faculté des Lettres et des Langues et des Sciences Sociales et Humaines","Département de la Langue et Littérature Arabe","Université_Larbi_Tebessi_de_TébessaFaculté_des_Lettres_et_des_Langues_et_des_Sciences_Sociales_et_Humaines"]
["U14E","Est","Université Larbi Tebessi de Tébessa","U. Tébessa","Faculté des Lettres et des Langues et des Sciences Sociales et Humaines","Département de Littérature et des Langues Etrangères","Université_Larbi_Tebessi_de_TébessaFaculté_des_Lettres_et_des_Langues_et_des_Sciences_Sociales_et_Humaines"]
["U14E","Est","Université Larbi Tebessi de Tébessa","U. Tébessa","Faculté des Lettres et des Langues et des Sciences Sociales et Humaines","Département des Sciences Humaines","Université_Larbi_Tebessi_de_TébessaFaculté_des_Lettres_et_des_Langues_et_des_Sciences_Sociales_et_Humaines"]
["U14E","Est","Université Larbi Tebessi de Tébessa","U. Tébessa","Faculté des Lettres et des Langues et des Sciences Sociales et Humaines","Département des Sciences Sociales","Université_Larbi_Tebessi_de_TébessaFaculté_des_Lettres_et_des_Langues_et_des_Sciences_Sociales_et_Humaines"]
["U14E","Est","Université Larbi Tebessi de Tébessa","U. Tébessa","Faculté des Sciences Economiques et des Sciences Commerciales et des Sciences de Gestion","Département des Sciences Commerciales","Université_Larbi_Tebessi_de_TébessaFaculté_des_Sciences_Economiques_et_des_Sciences_Commerciales_et_des_Sciences_de_Gestion"]
["U14E","Est","Université Larbi Tebessi de Tébessa","U. Tébessa","Faculté des Sciences Economiques et des Sciences Commerciales et des Sciences de Gestion","Département des Sciences de Gestion","Université_Larbi_Tebessi_de_TébessaFaculté_des_Sciences_Economiques_et_des_Sciences_Commerciales_et_des_Sciences_de_Gestion"]
["U14E","Est","Université Larbi Tebessi de Tébessa","U. Tébessa","Faculté des Sciences Economiques et des Sciences Commerciales et des Sciences de Gestion","Département des Sciences Economiques","Université_Larbi_Tebessi_de_TébessaFaculté_des_Sciences_Economiques_et_des_Sciences_Commerciales_et_des_Sciences_de_Gestion"]
["U14E","Est","Université Larbi Tebessi de Tébessa","U. Tébessa","Faculté des Sciences et de la Technologie","Département d’Architecture","Université_Larbi_Tebessi_de_TébessaFaculté_des_Sciences_et_de_la_Technologie"]
["U14E","Est","Université Larbi Tebessi de Tébessa","U. Tébessa","Faculté des Sciences et de la Technologie","Département de Génie Civil ","Université_Larbi_Tebessi_de_TébessaFaculté_des_Sciences_et_de_la_Technologie"]
["U14E","Est","Université Larbi Tebessi de Tébessa","U. Tébessa","Faculté des Sciences et de la Technologie","Département de Génie Electrique",{"$f":"CONCATENATE(SUBSTITUTE(C960,\" \",\"_\"),SUBSTITUTE(E960,\" \",\"_\"))","v":"Université_Larbi_Tebessi_de_TébessaFaculté_des_Sciences_et_de_la_Technologie"}]
["U14E","Est","Université Larbi Tebessi de Tébessa","U. Tébessa","Faculté des Sciences et de la Technologie","Département de Génie Mécanique ","Université_Larbi_Tebessi_de_TébessaFaculté_des_Sciences_et_de_la_Technologie"]
["U14E","Est","Université Larbi Tebessi de Tébessa","U. Tébessa","Faculté des Sciences et de la Technologie","Département des Mines ","Université_Larbi_Tebessi_de_TébessaFaculté_des_Sciences_et_de_la_Technologie"]
["U14E","Est","Université Larbi Tebessi de Tébessa","U. Tébessa","Faculté des Sciences et de la Technologie","Département des Sciences et de la Technologie","Université_Larbi_Tebessi_de_TébessaFaculté_des_Sciences_et_de_la_Technologie"]
["U14E","Est","Université Larbi Tebessi de Tébessa","U. Tébessa","Faculté des Sciences Exactes et des Sciences de la Nature et de la Vie","Département des Mathématiques et Informatique","Université_Larbi_Tebessi_de_TébessaFaculté_des_Sciences_Exactes_et_des_Sciences_de_la_Nature_et_de_la_Vie"]
["U14E","Est","Université Larbi Tebessi de Tébessa","U. Tébessa","Faculté des Sciences Exactes et des Sciences de la Nature et de la Vie","Département des Sciences de la Matière","Université_Larbi_Tebessi_de_TébessaFaculté_des_Sciences_Exactes_et_des_Sciences_de_la_Nature_et_de_la_Vie"]
["U14E","Est","Université Larbi Tebessi de Tébessa","U. Tébessa","Faculté des Sciences Exactes et des Sciences de la Nature et de la Vie","Département des Sciences de la Nature et de la Vie","Université_Larbi_Tebessi_de_TébessaFaculté_des_Sciences_Exactes_et_des_Sciences_de_la_Nature_et_de_la_Vie"]
["U14E","Est","Université Larbi Tebessi de Tébessa","U. Tébessa","Faculté des Sciences Exactes et des Sciences de la Nature et de la Vie","Département des Sciences de La Terre et de l’univers","Université_Larbi_Tebessi_de_TébessaFaculté_des_Sciences_Exactes_et_des_Sciences_de_la_Nature_et_de_la_Vie"]
["U01E","Est","Université Mentouri de Constantine 1","U. Constantine-1-","Faculté de Droit et des Sciences Politiques","Département d'attitude à la profession d'avocat","Université_Mentouri_de_Constantine_1Faculté_de_Droit_et_des_Sciences_Politiques"]
["U01E","Est","Université Mentouri de Constantine 1","U. Constantine-1-","Faculté de Droit et des Sciences Politiques","Département de Droit Privé","Université_Mentouri_de_Constantine_1Faculté_de_Droit_et_des_Sciences_Politiques"]
["U01E","Est","Université Mentouri de Constantine 1","U. Constantine-1-","Faculté de Droit et des Sciences Politiques","Département de Droit Public","Université_Mentouri_de_Constantine_1Faculté_de_Droit_et_des_Sciences_Politiques"]
["U01E","Est","Université Mentouri de Constantine 1","U. Constantine-1-","Faculté des Lettres et des Langues","Département de Traduction","Université_Mentouri_de_Constantine_1Faculté_des_Lettres_et_des_Langues"]
["U01E","Est","Université Mentouri de Constantine 1","U. Constantine-1-","Faculté des Lettres et des Langues","Département des Lettres et Langue Anglaise","Université_Mentouri_de_Constantine_1Faculté_des_Lettres_et_des_Langues"]
["U01E","Est","Université Mentouri de Constantine 1","U. Constantine-1-","Faculté des Lettres et des Langues","Département des Lettres et Langue Arabe","Université_Mentouri_de_Constantine_1Faculté_des_Lettres_et_des_Langues"]
["U01E","Est","Université Mentouri de Constantine 1","U. Constantine-1-","Faculté des Lettres et des Langues","Département desLettres et Langue Française","Université_Mentouri_de_Constantine_1Faculté_des_Lettres_et_des_Langues"]
["U01E","Est","Université Mentouri de Constantine 1","U. Constantine-1-","Faculté des Sciences de la Technologie","Département d’Electronique","Université_Mentouri_de_Constantine_1Faculté_des_Sciences_de_la_Technologie"]
["U01E","Est","Université Mentouri de Constantine 1","U. Constantine-1-","Faculté des Sciences de la Technologie","Département d’Electrotechnique","Université_Mentouri_de_Constantine_1Faculté_des_Sciences_de_la_Technologie"]
["U01E","Est","Université Mentouri de Constantine 1","U. Constantine-1-","Faculté des Sciences de la Technologie","Département Génie Civil","Université_Mentouri_de_Constantine_1Faculté_des_Sciences_de_la_Technologie"]
["U01E","Est","Université Mentouri de Constantine 1","U. Constantine-1-","Faculté des Sciences de la Technologie","Département Génie Climatique","Université_Mentouri_de_Constantine_1Faculté_des_Sciences_de_la_Technologie"]
["U01E","Est","Université Mentouri de Constantine 1","U. Constantine-1-","Faculté des Sciences de la Technologie","Département Génie des Transports","Université_Mentouri_de_Constantine_1Faculté_des_Sciences_de_la_Technologie"]
["U01E","Est","Université Mentouri de Constantine 1","U. Constantine-1-","Faculté des Sciences de la Technologie","Département Génie Mécanique","Université_Mentouri_de_Constantine_1Faculté_des_Sciences_de_la_Technologie"]
["U01E","Est","Université Mentouri de Constantine 1","U. Constantine-1-","Faculté des Sciences de la Terre",null,"Université_Mentouri_de_Constantine_1Faculté_des_Sciences_de_la_Terre"]
["U01E","Est","Université Mentouri de Constantine 1","U. Constantine-1-","Faculté des Sciences Exactes","Département de Chimie","Université_Mentouri_de_Constantine_1Faculté_des_Sciences_Exactes"]
["U01E","Est","Université Mentouri de Constantine 1","U. Constantine-1-","Faculté des Sciences Exactes","Département de Physique","Université_Mentouri_de_Constantine_1Faculté_des_Sciences_Exactes"]
["U01E","Est","Université Mentouri de Constantine 1","U. Constantine-1-","Faculté Sciences de la Nature et de la Vie","Département de Biochimie et Biologie Cellulaire et Moléculaire","Université_Mentouri_de_Constantine_1Faculté_Sciences_de_la_Nature_et_de_la_Vie"]
["U01E","Est","Université Mentouri de Constantine 1","U. Constantine-1-","Faculté Sciences de la Nature et de la Vie","Département de Biologie Animale","Université_Mentouri_de_Constantine_1Faculté_Sciences_de_la_Nature_et_de_la_Vie"]
["U01E","Est","Université Mentouri de Constantine 1","U. Constantine-1-","Faculté Sciences de la Nature et de la Vie","Département de Biologie Appliqué","Université_Mentouri_de_Constantine_1Faculté_Sciences_de_la_Nature_et_de_la_Vie"]
["U01E","Est","Université Mentouri de Constantine 1","U. Constantine-1-","Faculté Sciences de la Nature et de la Vie","Département de Biologie Végétale et éEcologie","Université_Mentouri_de_Constantine_1Faculté_Sciences_de_la_Nature_et_de_la_Vie"]
["U01E","Est","Université Mentouri de Constantine 1","U. Constantine-1-","Faculté Sciences de la Nature et de la Vie","Département de Microbiologie","Université_Mentouri_de_Constantine_1Faculté_Sciences_de_la_Nature_et_de_la_Vie"]
["U01E","Est","Université Mentouri de Constantine 1","U. Constantine-1-","Institut de Nutrition, Alimentation et Technologies Agroalimentaires","Département de Biotechnologie","Université_Mentouri_de_Constantine_1Institut_de_Nutrition,_Alimentation_et_Technologies_Agroalimentaires"]
["U01E","Est","Université Mentouri de Constantine 1","U. Constantine-1-","Institut de Nutrition, Alimentation et Technologies Agroalimentaires","Département de Nutrition ","Université_Mentouri_de_Constantine_1Institut_de_Nutrition,_Alimentation_et_Technologies_Agroalimentaires"]
["U01E","Est","Université Mentouri de Constantine 1","U. Constantine-1-","Institut de Nutrition, Alimentation et Technologies Agroalimentaires","Technologie Alimentaire","Université_Mentouri_de_Constantine_1Institut_de_Nutrition,_Alimentation_et_Technologies_Agroalimentaires"]
["U01E","Est","Université Mentouri de Constantine 1","U. Constantine-1-","Institut des Sciences Vétérinaires","Département d’Hygiène et Santé Animale","Université_Mentouri_de_Constantine_1Institut_des_Sciences_Vétérinaires"]
["U01E","Est","Université Mentouri de Constantine 1","U. Constantine-1-","Institut des Sciences Vétérinaires","Département de Médecine, Chirurgie et reproduction animale","Université_Mentouri_de_Constantine_1Institut_des_Sciences_Vétérinaires"]
["U01E","Est","Université Mentouri de Constantine 1","U. Constantine-1-","Institut des Sciences Vétérinaires","Département de Préclinique","Université_Mentouri_de_Constantine_1Institut_des_Sciences_Vétérinaires"]
["U01E","Est","Université Mentouri de Constantine 1","U. Constantine-1-","Institut des Sciences Vétérinaires","Département de Produits Animales","Université_Mentouri_de_Constantine_1Institut_des_Sciences_Vétérinaires"]
["U06C","Centre","Université Mhamed Bougara de Boumerdès","U. Boumerdès","Faculté de Droit","Département de Droit privé","Université_Mhamed_Bougara_de_BoumerdèsFaculté_de_Droit"]
["U06C","Centre","Université Mhamed Bougara de Boumerdès","U. Boumerdès","Faculté de Droit","Département de Droit public","Université_Mhamed_Bougara_de_BoumerdèsFaculté_de_Droit"]
["U06C","Centre","Université Mhamed Bougara de Boumerdès","U. Boumerdès","Faculté de Droit","Département de Langue arabe et de la Littérature","Université_Mhamed_Bougara_de_BoumerdèsFaculté_de_Droit"]
["U06C","Centre","Université Mhamed Bougara de Boumerdès","U. Boumerdès","Faculté de Droit","Département de Sciences Politiques","Université_Mhamed_Bougara_de_BoumerdèsFaculté_de_Droit"]
["U06C","Centre","Université Mhamed Bougara de Boumerdès","U. Boumerdès","Faculté des Hydrocarbures et de la Chimie  ","Département d’Automatisation ","Université_Mhamed_Bougara_de_BoumerdèsFaculté_des_Hydrocarbures_et_de_la_Chimie _"]
["U06C","Centre","Université Mhamed Bougara de Boumerdès","U. Boumerdès","Faculté des Hydrocarbures et de la Chimie  ","Département d’Economie","Université_Mhamed_Bougara_de_BoumerdèsFaculté_des_Hydrocarbures_et_de_la_Chimie _"]
["U06C","Centre","Université Mhamed Bougara de Boumerdès","U. Boumerdès","Faculté des Hydrocarbures et de la Chimie  ","Département de Génie des Procédés Chimiques ","Université_Mhamed_Bougara_de_BoumerdèsFaculté_des_Hydrocarbures_et_de_la_Chimie _"]
["U06C","Centre","Université Mhamed Bougara de Boumerdès","U. Boumerdès","Faculté des Hydrocarbures et de la Chimie  ","Département de Géophysique ","Université_Mhamed_Bougara_de_BoumerdèsFaculté_des_Hydrocarbures_et_de_la_Chimie _"]
["U06C","Centre","Université Mhamed Bougara de Boumerdès","U. Boumerdès","Faculté des Hydrocarbures et de la Chimie  ","Département de Transport ","Université_Mhamed_Bougara_de_BoumerdèsFaculté_des_Hydrocarbures_et_de_la_Chimie _"]
["U06C","Centre","Université Mhamed Bougara de Boumerdès","U. Boumerdès","Faculté des Hydrocarbures et de la Chimie  ","Département des Gisements Miniers et Pétroliers ","Université_Mhamed_Bougara_de_BoumerdèsFaculté_des_Hydrocarbures_et_de_la_Chimie _"]
["U06C","Centre","Université Mhamed Bougara de Boumerdès","U. Boumerdès","Faculté des Sciences de l’Ingénieur ","Département d’Energétique ","Université_Mhamed_Bougara_de_BoumerdèsFaculté_des_Sciences_de_l’Ingénieur "]
["U06C","Centre","Université Mhamed Bougara de Boumerdès","U. Boumerdès","Faculté des Sciences de l’Ingénieur ","Département de Génie Civil ","Université_Mhamed_Bougara_de_BoumerdèsFaculté_des_Sciences_de_l’Ingénieur "]
["U06C","Centre","Université Mhamed Bougara de Boumerdès","U. Boumerdès","Faculté des Sciences de l’Ingénieur ","Département de Génie de l’Environnement","Université_Mhamed_Bougara_de_BoumerdèsFaculté_des_Sciences_de_l’Ingénieur "]
["U06C","Centre","Université Mhamed Bougara de Boumerdès","U. Boumerdès","Faculté des Sciences de l’Ingénieur ","Département de Génie des Matériaux","Université_Mhamed_Bougara_de_BoumerdèsFaculté_des_Sciences_de_l’Ingénieur "]
["U06C","Centre","Université Mhamed Bougara de Boumerdès","U. Boumerdès","Faculté des Sciences de l’Ingénieur ","Département de Génie des Procédés Industriels ","Université_Mhamed_Bougara_de_BoumerdèsFaculté_des_Sciences_de_l’Ingénieur "]
["U06C","Centre","Université Mhamed Bougara de Boumerdès","U. Boumerdès","Faculté des Sciences de l’Ingénieur ","Département de Génie Mécanique ","Université_Mhamed_Bougara_de_BoumerdèsFaculté_des_Sciences_de_l’Ingénieur "]
["U06C","Centre","Université Mhamed Bougara de Boumerdès","U. Boumerdès","Faculté des Sciences de l’Ingénieur ","Département de Maintenance Industrielle ","Université_Mhamed_Bougara_de_BoumerdèsFaculté_des_Sciences_de_l’Ingénieur "]
["U06C","Centre","Université Mhamed Bougara de Boumerdès","U. Boumerdès","Faculté des Sciences de l’Ingénieur ","Département de Technologie Alimentaire ","Université_Mhamed_Bougara_de_BoumerdèsFaculté_des_Sciences_de_l’Ingénieur "]
["U06C","Centre","Université Mhamed Bougara de Boumerdès","U. Boumerdès","Faculté des Sciences Economiques, Commerciales et des Sciences de Gestion","Département des Sciences Commerciales","Université_Mhamed_Bougara_de_BoumerdèsFaculté_des_Sciences_Economiques,_Commerciales_et_des_Sciences_de_Gestion"]
["U06C","Centre","Université Mhamed Bougara de Boumerdès","U. Boumerdès","Faculté des Sciences Economiques, Commerciales et des Sciences de Gestion","Département des Sciences de Gestion","Université_Mhamed_Bougara_de_BoumerdèsFaculté_des_Sciences_Economiques,_Commerciales_et_des_Sciences_de_Gestion"]
["U06C","Centre","Université Mhamed Bougara de Boumerdès","U. Boumerdès","Faculté des Sciences Economiques, Commerciales et des Sciences de Gestion","Département des Sciences Economiques","Université_Mhamed_Bougara_de_BoumerdèsFaculté_des_Sciences_Economiques,_Commerciales_et_des_Sciences_de_Gestion"]
["U06C","Centre","Université Mhamed Bougara de Boumerdès","U. Boumerdès","Faculté des Sciences ","Département de Biologie","Université_Mhamed_Bougara_de_BoumerdèsFaculté_des_Sciences "]
["U06C","Centre","Université Mhamed Bougara de Boumerdès","U. Boumerdès","Faculté des Sciences ","Département de Chimie","Université_Mhamed_Bougara_de_BoumerdèsFaculté_des_Sciences "]
["U06C","Centre","Université Mhamed Bougara de Boumerdès","U. Boumerdès","Faculté des Sciences ","Département de Physique","Université_Mhamed_Bougara_de_BoumerdèsFaculté_des_Sciences "]
["U06C","Centre","Université Mhamed Bougara de Boumerdès","U. Boumerdès","Faculté des Sciences ","Département des Langues","Université_Mhamed_Bougara_de_BoumerdèsFaculté_des_Sciences "]
["U06C","Centre","Université Mhamed Bougara de Boumerdès","U. Boumerdès","Faculté des Sciences ","Département des Mathématiques","Université_Mhamed_Bougara_de_BoumerdèsFaculté_des_Sciences "]
["U06C","Centre","Université Mhamed Bougara de Boumerdès","U. Boumerdès","Faculté des Sciences ","Département d'Informatique","Université_Mhamed_Bougara_de_BoumerdèsFaculté_des_Sciences "]
["U06C","Centre","Université Mhamed Bougara de Boumerdès","U. Boumerdès","Institut de Génie Electrique et Electronique ","Département d'Electronique","Université_Mhamed_Bougara_de_BoumerdèsInstitut_de_Génie_Electrique_et_Electronique "]
["U06C","Centre","Université Mhamed Bougara de Boumerdès","U. Boumerdès","Institut de Génie Electrique et Electronique ","Département d'Electrotechnique et d'Automatique",{"$f":"CONCATENATE(SUBSTITUTE(C1024,\" \",\"_\"),SUBSTITUTE(E1024,\" \",\"_\"))","v":"Université_Mhamed_Bougara_de_BoumerdèsInstitut_de_Génie_Electrique_et_Electronique "}]
["U06C","Centre","Université Mhamed Bougara de Boumerdès","U. Boumerdès","Institut de Génie Electrique et Electronique ","Département des Enseignements de Base","Université_Mhamed_Bougara_de_BoumerdèsInstitut_de_Génie_Electrique_et_Electronique "]
["U06E","Est","Université Mohamed Khider de Biskra","U. Biskra","Faculté  des Sciences Humaines et Sociales","Département des Sciences Humaines","Université_Mohamed_Khider_de_BiskraFaculté__des_Sciences_Humaines_et_Sociales"]
["U06E","Est","Université Mohamed Khider de Biskra","U. Biskra","Faculté  des Sciences Humaines et Sociales","Département des Sciences Sociales","Université_Mohamed_Khider_de_BiskraFaculté__des_Sciences_Humaines_et_Sociales"]
["U06E","Est","Université Mohamed Khider de Biskra","U. Biskra","Faculté de Droit et des Sciences Politiques","Département de Droit","Université_Mohamed_Khider_de_BiskraFaculté_de_Droit_et_des_Sciences_Politiques"]
["U06E","Est","Université Mohamed Khider de Biskra","U. Biskra","Faculté de Droit et des Sciences Politiques","Département des Sciences Politiques","Université_Mohamed_Khider_de_BiskraFaculté_de_Droit_et_des_Sciences_Politiques"]
["U06E","Est","Université Mohamed Khider de Biskra","U. Biskra","Faculté des Lettres et des Langues","Départements des Lettres et Langues Arabes","Université_Mohamed_Khider_de_BiskraFaculté_des_Lettres_et_des_Langues"]
["U06E","Est","Université Mohamed Khider de Biskra","U. Biskra","Faculté des Lettres et des Langues","Départements des Lettres et Langues Etrangères","Université_Mohamed_Khider_de_BiskraFaculté_des_Lettres_et_des_Langues"]
["U06E","Est","Université Mohamed Khider de Biskra","U. Biskra","Faculté des Sciences Economiques, Commerciales et des Sciences de Gestion","Département des Sciences Commerciales","Université_Mohamed_Khider_de_BiskraFaculté_des_Sciences_Economiques,_Commerciales_et_des_Sciences_de_Gestion"]
["U06E","Est","Université Mohamed Khider de Biskra","U. Biskra","Faculté des Sciences Economiques, Commerciales et des Sciences de Gestion","Département des Sciences de Gestion","Université_Mohamed_Khider_de_BiskraFaculté_des_Sciences_Economiques,_Commerciales_et_des_Sciences_de_Gestion"]
["U06E","Est","Université Mohamed Khider de Biskra","U. Biskra","Faculté des Sciences Economiques, Commerciales et des Sciences de Gestion","Département des Sciences Economiques","Université_Mohamed_Khider_de_BiskraFaculté_des_Sciences_Economiques,_Commerciales_et_des_Sciences_de_Gestion"]
["U06E","Est","Université Mohamed Khider de Biskra","U. Biskra","Faculté des Sciences et de la Technologie","Département d’Architecture","Université_Mohamed_Khider_de_BiskraFaculté_des_Sciences_et_de_la_Technologie"]
["U06E","Est","Université Mohamed Khider de Biskra","U. Biskra","Faculté des Sciences et de la Technologie","Département de Chimie Industrielle","Université_Mohamed_Khider_de_BiskraFaculté_des_Sciences_et_de_la_Technologie"]
["U06E","Est","Université Mohamed Khider de Biskra","U. Biskra","Faculté des Sciences et de la Technologie","Département de Génie Civil et Hydraulique","Université_Mohamed_Khider_de_BiskraFaculté_des_Sciences_et_de_la_Technologie"]
["U06E","Est","Université Mohamed Khider de Biskra","U. Biskra","Faculté des Sciences et de la Technologie","Département de Génie Electrique","Université_Mohamed_Khider_de_BiskraFaculté_des_Sciences_et_de_la_Technologie"]
["U06E","Est","Université Mohamed Khider de Biskra","U. Biskra","Faculté des Sciences et de la Technologie","Département de Génie Mécanique","Université_Mohamed_Khider_de_BiskraFaculté_des_Sciences_et_de_la_Technologie"]
["U06E","Est","Université Mohamed Khider de Biskra","U. Biskra","Faculté des Sciences et de la Technologie","Tronc Commun ST","Université_Mohamed_Khider_de_BiskraFaculté_des_Sciences_et_de_la_Technologie"]
["U06E","Est","Université Mohamed Khider de Biskra","U. Biskra","Faculté des Sciences Exactes, des Sciences de la Nature et de la Vie","Département d’Informatique","Université_Mohamed_Khider_de_BiskraFaculté_des_Sciences_Exactes,_des_Sciences_de_la_Nature_et_de_la_Vie"]
["U06E","Est","Université Mohamed Khider de Biskra","U. Biskra","Faculté des Sciences Exactes, des Sciences de la Nature et de la Vie","Département des Mathématiques","Université_Mohamed_Khider_de_BiskraFaculté_des_Sciences_Exactes,_des_Sciences_de_la_Nature_et_de_la_Vie"]
["U06E","Est","Université Mohamed Khider de Biskra","U. Biskra","Faculté des Sciences Exactes, des Sciences de la Nature et de la Vie","Département des Sciences Agronomiques","Université_Mohamed_Khider_de_BiskraFaculté_des_Sciences_Exactes,_des_Sciences_de_la_Nature_et_de_la_Vie"]
["U06E","Est","Université Mohamed Khider de Biskra","U. Biskra","Faculté des Sciences Exactes, des Sciences de la Nature et de la Vie","Département des Sciences de la Matière","Université_Mohamed_Khider_de_BiskraFaculté_des_Sciences_Exactes,_des_Sciences_de_la_Nature_et_de_la_Vie"]
["U06E","Est","Université Mohamed Khider de Biskra","U. Biskra","Faculté des Sciences Exactes, des Sciences de la Nature et de la Vie","Département des Sciences de la Nature et de la Vie","Université_Mohamed_Khider_de_BiskraFaculté_des_Sciences_Exactes,_des_Sciences_de_la_Nature_et_de_la_Vie"]
["U06E","Est","Université Mohamed Khider de Biskra","U. Biskra","Faculté des Sciences Exactes, des Sciences de la Nature et de la Vie","Département des Sciences de la Terre et de l'Univers","Université_Mohamed_Khider_de_BiskraFaculté_des_Sciences_Exactes,_des_Sciences_de_la_Nature_et_de_la_Vie"]
["U06E","Est","Université Mohamed Khider de Biskra","U. Biskra","Institut des Sciences et Techniques des Activités Physiques et Sportifs",null,"Université_Mohamed_Khider_de_BiskraInstitut_des_Sciences_et_Techniques_des_Activités_Physiques_et_Sportifs"]
["U03C","Centre","Université Mouloud Maameri de Tizi Ouzou","U. Tizi Ouzou","Faculté de Droit et des Sciences Politiques","Département Droit ","Université_Mouloud_Maameri_de_Tizi_OuzouFaculté_de_Droit_et_des_Sciences_Politiques"]
["U03C","Centre","Université Mouloud Maameri de Tizi Ouzou","U. Tizi Ouzou","Faculté de Droit et des Sciences Politiques","Département Sciences Politiques","Université_Mouloud_Maameri_de_Tizi_OuzouFaculté_de_Droit_et_des_Sciences_Politiques"]
["U03C","Centre","Université Mouloud Maameri de Tizi Ouzou","U. Tizi Ouzou","Faculté de Génie de la Construction ","Département d’Architecture","Université_Mouloud_Maameri_de_Tizi_OuzouFaculté_de_Génie_de_la_Construction "]
["U03C","Centre","Université Mouloud Maameri de Tizi Ouzou","U. Tizi Ouzou","Faculté de Génie de la Construction ","Département de Génie Civil ","Université_Mouloud_Maameri_de_Tizi_OuzouFaculté_de_Génie_de_la_Construction "]
["U03C","Centre","Université Mouloud Maameri de Tizi Ouzou","U. Tizi Ouzou","Faculté de Génie de la Construction ","Département de Génie Mécanique","Université_Mouloud_Maameri_de_Tizi_OuzouFaculté_de_Génie_de_la_Construction "]
["U03C","Centre","Université Mouloud Maameri de Tizi Ouzou","U. Tizi Ouzou","Faculté de Médecine","Département de Chirurgie Dentaire","Université_Mouloud_Maameri_de_Tizi_OuzouFaculté_de_Médecine"]
["U03C","Centre","Université Mouloud Maameri de Tizi Ouzou","U. Tizi Ouzou","Faculté de Médecine","Département de Médecine","Université_Mouloud_Maameri_de_Tizi_OuzouFaculté_de_Médecine"]
["U03C","Centre","Université Mouloud Maameri de Tizi Ouzou","U. Tizi Ouzou","Faculté de Médecine","Département de Pharmacie","Université_Mouloud_Maameri_de_Tizi_OuzouFaculté_de_Médecine"]
["U03C","Centre","Université Mouloud Maameri de Tizi Ouzou","U. Tizi Ouzou","Faculté des Lettres et Langues ","Département d’Interprétariat","Université_Mouloud_Maameri_de_Tizi_OuzouFaculté_des_Lettres_et_Langues "]
["U03C","Centre","Université Mouloud Maameri de Tizi Ouzou","U. Tizi Ouzou","Faculté des Lettres et Langues ","Département de Français","Université_Mouloud_Maameri_de_Tizi_OuzouFaculté_des_Lettres_et_Langues "]
["U03C","Centre","Université Mouloud Maameri de Tizi Ouzou","U. Tizi Ouzou","Faculté des Lettres et Langues ","Département de Langue et Culture Amazighes","Université_Mouloud_Maameri_de_Tizi_OuzouFaculté_des_Lettres_et_Langues "]
["U03C","Centre","Université Mouloud Maameri de Tizi Ouzou","U. Tizi Ouzou","Faculté des Lettres et Langues ","Département de Lettres Arabes","Université_Mouloud_Maameri_de_Tizi_OuzouFaculté_des_Lettres_et_Langues "]
["U03C","Centre","Université Mouloud Maameri de Tizi Ouzou","U. Tizi Ouzou","Faculté des Sciences Biologiques et Sciences Agronomiques","Département d’Agronomie","Université_Mouloud_Maameri_de_Tizi_OuzouFaculté_des_Sciences_Biologiques_et_Sciences_Agronomiques"]
["U03C","Centre","Université Mouloud Maameri de Tizi Ouzou","U. Tizi Ouzou","Faculté des Sciences Biologiques et Sciences Agronomiques","Département de Biologie","Université_Mouloud_Maameri_de_Tizi_OuzouFaculté_des_Sciences_Biologiques_et_Sciences_Agronomiques"]
["U03C","Centre","Université Mouloud Maameri de Tizi Ouzou","U. Tizi Ouzou","Faculté des Sciences Economiques, Commerciales et des Sciences de Gestion","Département des Sciences Commerciales","Université_Mouloud_Maameri_de_Tizi_OuzouFaculté_des_Sciences_Economiques,_Commerciales_et_des_Sciences_de_Gestion"]
["U03C","Centre","Université Mouloud Maameri de Tizi Ouzou","U. Tizi Ouzou","Faculté des Sciences Economiques, Commerciales et des Sciences de Gestion","Département des Sciences de Gestion","Université_Mouloud_Maameri_de_Tizi_OuzouFaculté_des_Sciences_Economiques,_Commerciales_et_des_Sciences_de_Gestion"]
["U03C","Centre","Université Mouloud Maameri de Tizi Ouzou","U. Tizi Ouzou","Faculté des Sciences Economiques, Commerciales et des Sciences de Gestion","Département des Sciences Economiques","Université_Mouloud_Maameri_de_Tizi_OuzouFaculté_des_Sciences_Economiques,_Commerciales_et_des_Sciences_de_Gestion"]
["U03C","Centre","Université Mouloud Maameri de Tizi Ouzou","U. Tizi Ouzou","Faculté des Sciences Humaines et Sociales","Département Psychologie","Université_Mouloud_Maameri_de_Tizi_OuzouFaculté_des_Sciences_Humaines_et_Sociales"]
["U03C","Centre","Université Mouloud Maameri de Tizi Ouzou","U. Tizi Ouzou","Faculté des Sciences Humaines et Sociales","Département Sciences Humaines","Université_Mouloud_Maameri_de_Tizi_OuzouFaculté_des_Sciences_Humaines_et_Sociales"]
["U03C","Centre","Université Mouloud Maameri de Tizi Ouzou","U. Tizi Ouzou","Faculté des Sciences Humaines et Sociales","Département Sciences Sociales","Université_Mouloud_Maameri_de_Tizi_OuzouFaculté_des_Sciences_Humaines_et_Sociales"]
["U03C","Centre","Université Mouloud Maameri de Tizi Ouzou","U. Tizi Ouzou","Faculté des Sciences ","Département de Chimie","Université_Mouloud_Maameri_de_Tizi_OuzouFaculté_des_Sciences "]
["U03C","Centre","Université Mouloud Maameri de Tizi Ouzou","U. Tizi Ouzou","Faculté des Sciences ","Département de Mathématiques","Université_Mouloud_Maameri_de_Tizi_OuzouFaculté_des_Sciences "]
["U03C","Centre","Université Mouloud Maameri de Tizi Ouzou","U. Tizi Ouzou","Faculté des Sciences ","Département de Physique","Université_Mouloud_Maameri_de_Tizi_OuzouFaculté_des_Sciences "]
["U03C","Centre","Université Mouloud Maameri de Tizi Ouzou","U. Tizi Ouzou","Faculté Génie Electrique et Informatique ","Département d’Automatique","Université_Mouloud_Maameri_de_Tizi_OuzouFaculté_Génie_Electrique_et_Informatique "]
["U03C","Centre","Université Mouloud Maameri de Tizi Ouzou","U. Tizi Ouzou","Faculté Génie Electrique et Informatique ","Département d’Electronique","Université_Mouloud_Maameri_de_Tizi_OuzouFaculté_Génie_Electrique_et_Informatique "]
["U03C","Centre","Université Mouloud Maameri de Tizi Ouzou","U. Tizi Ouzou","Faculté Génie Electrique et Informatique ","Département d’Electrotechnique","Université_Mouloud_Maameri_de_Tizi_OuzouFaculté_Génie_Electrique_et_Informatique "]
["U03C","Centre","Université Mouloud Maameri de Tizi Ouzou","U. Tizi Ouzou","Faculté Génie Electrique et Informatique ","Département d’Informatique","Université_Mouloud_Maameri_de_Tizi_OuzouFaculté_Génie_Electrique_et_Informatique "]
["U04C","Centre","Université Saâd Dahlab de Blida 1","U. Blida-1-","Faculté de Médecine","Département Médecine","Université_Saâd_Dahlab_de_Blida_1Faculté_de_Médecine"]
["U04C","Centre","Université Saâd Dahlab de Blida 1","U. Blida-1-","Faculté de Médecine","Département Chirurgie Dentaire","Université_Saâd_Dahlab_de_Blida_1Faculté_de_Médecine"]
["U04C","Centre","Université Saâd Dahlab de Blida 1","U. Blida-1-","Faculté de Médecine","Département Pharmacie","Université_Saâd_Dahlab_de_Blida_1Faculté_de_Médecine"]
["U04C","Centre","Université Saâd Dahlab de Blida 1","U. Blida-1-","Faculté de technologie","Département Architecture \n","Université_Saâd_Dahlab_de_Blida_1Faculté_de_technologie"]
["U04C","Centre","Université Saâd Dahlab de Blida 1","U. Blida-1-","Faculté de technologie","Département Génie des procédes","Université_Saâd_Dahlab_de_Blida_1Faculté_de_technologie"]
["U04C","Centre","Université Saâd Dahlab de Blida 1","U. Blida-1-","Faculté de technologie","Département Electronique","Université_Saâd_Dahlab_de_Blida_1Faculté_de_technologie"]
["U04C","Centre","Université Saâd Dahlab de Blida 1","U. Blida-1-","Faculté de technologie","Département Génie civil","Université_Saâd_Dahlab_de_Blida_1Faculté_de_technologie"]
["U04C","Centre","Université Saâd Dahlab de Blida 1","U. Blida-1-","Faculté de technologie","Département Mécanique","Université_Saâd_Dahlab_de_Blida_1Faculté_de_technologie"]
["U04C","Centre","Université Saâd Dahlab de Blida 1","U. Blida-1-","Faculté de technologie","Département Science de l’eau et de l’environnement","Université_Saâd_Dahlab_de_Blida_1Faculté_de_technologie"]
["U04C","Centre","Université Saâd Dahlab de Blida 1","U. Blida-1-","Faculté des sciences","Département Informatique","Université_Saâd_Dahlab_de_Blida_1Faculté_des_sciences"]
["U04C","Centre","Université Saâd Dahlab de Blida 1","U. Blida-1-","Faculté des sciences","Département Mathématiques","Université_Saâd_Dahlab_de_Blida_1Faculté_des_sciences"]
["U04C","Centre","Université Saâd Dahlab de Blida 1","U. Blida-1-","Faculté des sciences","Département Chimie","Université_Saâd_Dahlab_de_Blida_1Faculté_des_sciences"]
["U04C","Centre","Université Saâd Dahlab de Blida 1","U. Blida-1-","Faculté des sciences","Département Physique","Université_Saâd_Dahlab_de_Blida_1Faculté_des_sciences"]
["U04C","Centre","Université Saâd Dahlab de Blida 1","U. Blida-1-","Faculté des Sciences de la Nature et de la Vie  ","Département Biologie des populations et des organismes",{"$f":"CONCATENATE(SUBSTITUTE(C1088,\" \",\"_\"),SUBSTITUTE(E1088,\" \",\"_\"))","v":"Université_Saâd_Dahlab_de_Blida_1Faculté_des_Sciences_de_la_Nature_et_de_la_Vie__"}]
["U04C","Centre","Université Saâd Dahlab de Blida 1","U. Blida-1-","Faculté des Sciences de la Nature et de la Vie  ","Département Biologie et physiologie cellulaire","Université_Saâd_Dahlab_de_Blida_1Faculté_des_Sciences_de_la_Nature_et_de_la_Vie__"]
["U04C","Centre","Université Saâd Dahlab de Blida 1","U. Blida-1-","Faculté des Sciences de la Nature et de la Vie  ","Département Biotechnologie","Université_Saâd_Dahlab_de_Blida_1Faculté_des_Sciences_de_la_Nature_et_de_la_Vie__"]
["U04C","Centre","Université Saâd Dahlab de Blida 1","U. Blida-1-","Faculté des Sciences de la Nature et de la Vie  ","Département Agro-Alimentaire","Université_Saâd_Dahlab_de_Blida_1Faculté_des_Sciences_de_la_Nature_et_de_la_Vie__"]
["U04C","Centre","Université Saâd Dahlab de Blida 1","U. Blida-1-","Institut des Sciences Vétérinaires",null,"Université_Saâd_Dahlab_de_Blida_1Institut_des_Sciences_Vétérinaires"]
["U10O","Ouest","Université Tahar Moulay de Saida","U. Saida","Faculté de Technologie","Départements d’Electronique","Université_Tahar_Moulay_de_SaidaFaculté_de_Technologie"]
["U10O","Ouest","Université Tahar Moulay de Saida","U. Saida","Faculté de Technologie","Départements d’Electrotechnique","Université_Tahar_Moulay_de_SaidaFaculté_de_Technologie"]
["U10O","Ouest","Université Tahar Moulay de Saida","U. Saida","Faculté de Technologie","Départements d’Informatique","Université_Tahar_Moulay_de_SaidaFaculté_de_Technologie"]
["U10O","Ouest","Université Tahar Moulay de Saida","U. Saida","Faculté de Technologie","Départements de Génie Civil-Hydraulique","Université_Tahar_Moulay_de_SaidaFaculté_de_Technologie"]
["U10O","Ouest","Université Tahar Moulay de Saida","U. Saida","Faculté des Sciences Sociales et Humaines","Départements des Sciences Humaines","Université_Tahar_Moulay_de_SaidaFaculté_des_Sciences_Sociales_et_Humaines"]
["U10O","Ouest","Université Tahar Moulay de Saida","U. Saida","Faculté des Sciences Sociales et Humaines","Départements des Sciences Sociales","Université_Tahar_Moulay_de_SaidaFaculté_des_Sciences_Sociales_et_Humaines"]
["U10O","Ouest","Université Tahar Moulay de Saida","U. Saida","Facultés de Droit et de Science Politique","Départements de Droit","Université_Tahar_Moulay_de_SaidaFacultés_de_Droit_et_de_Science_Politique"]
["U10O","Ouest","Université Tahar Moulay de Saida","U. Saida","Facultés de Droit et de Science Politique","Départements des Sciences Politiques","Université_Tahar_Moulay_de_SaidaFacultés_de_Droit_et_de_Science_Politique"]
["U10O","Ouest","Université Tahar Moulay de Saida","U. Saida","Facultés des Lettres et des Langues et des Arts","Départements de la Langue Anglaise","Université_Tahar_Moulay_de_SaidaFacultés_des_Lettres_et_des_Langues_et_des_Arts"]
["U10O","Ouest","Université Tahar Moulay de Saida","U. Saida","Facultés des Lettres et des Langues et des Arts","Départements de la Langue Arabe","Université_Tahar_Moulay_de_SaidaFacultés_des_Lettres_et_des_Langues_et_des_Arts"]
["U10O","Ouest","Université Tahar Moulay de Saida","U. Saida","Facultés des Lettres et des Langues et des Arts","Départements de la Langue Française","Université_Tahar_Moulay_de_SaidaFacultés_des_Lettres_et_des_Langues_et_des_Arts"]
["U10O","Ouest","Université Tahar Moulay de Saida","U. Saida","Facultés des Lettres et des Langues et des Arts","Départements des arts","Université_Tahar_Moulay_de_SaidaFacultés_des_Lettres_et_des_Langues_et_des_Arts"]
["U10O","Ouest","Université Tahar Moulay de Saida","U. Saida","Facultés des Sciences","Départements de Biologie","Université_Tahar_Moulay_de_SaidaFacultés_des_Sciences"]
["U10O","Ouest","Université Tahar Moulay de Saida","U. Saida","Facultés des Sciences","Départements de Chimie","Université_Tahar_Moulay_de_SaidaFacultés_des_Sciences"]
["U10O","Ouest","Université Tahar Moulay de Saida","U. Saida","Facultés des Sciences","Départements de Physique","Université_Tahar_Moulay_de_SaidaFacultés_des_Sciences"]
["U10O","Ouest","Université Tahar Moulay de Saida","U. Saida","Facultés des Sciences","Départements des Mathématiques","Université_Tahar_Moulay_de_SaidaFacultés_des_Sciences"]
["U10O","Ouest","Université Tahar Moulay de Saida","U. Saida","Facultés des Sciences Economiques et Sciences Commerciales et Sciences de Gestions","Département Sciences Commerciales","Université_Tahar_Moulay_de_SaidaFacultés_des_Sciences_Economiques_et_Sciences_Commerciales_et_Sciences_de_Gestions"]
["U10O","Ouest","Université Tahar Moulay de Saida","U. Saida","Facultés des Sciences Economiques et Sciences Commerciales et Sciences de Gestions","Département Sciences Économiques","Université_Tahar_Moulay_de_SaidaFacultés_des_Sciences_Economiques_et_Sciences_Commerciales_et_Sciences_de_Gestions"]
["U10O","Ouest","Université Tahar Moulay de Saida","U. Saida","Facultés des Sciences Economiques et Sciences Commerciales et Sciences de Gestions","Département Sciences Économiques","Université_Tahar_Moulay_de_SaidaFacultés_des_Sciences_Economiques_et_Sciences_Commerciales_et_Sciences_de_Gestions"]
["U10C","Centre","Université Yahia Farès de Médéa","U. Médéa","Faculté de Droit","Département de Droit","Université_Yahia_Farès_de_MédéaFaculté_de_Droit"]
["U10C","Centre","Université Yahia Farès de Médéa","U. Médéa","Faculté des Lettres, des Langues, et des Sciences Humaines",null,"Université_Yahia_Farès_de_MédéaFaculté_des_Lettres,_des_Langues,_et_des_Sciences_Humaines"]
["U10C","Centre","Université Yahia Farès de Médéa","U. Médéa","Faculté des Sciences Economiques, Commerciales et des Sciences de Gestion","Département des Sciences Commerciales","Université_Yahia_Farès_de_MédéaFaculté_des_Sciences_Economiques,_Commerciales_et_des_Sciences_de_Gestion"]
["U10C","Centre","Université Yahia Farès de Médéa","U. Médéa","Faculté des Sciences Economiques, Commerciales et des Sciences de Gestion","Département des Sciences de Gestion","Université_Yahia_Farès_de_MédéaFaculté_des_Sciences_Economiques,_Commerciales_et_des_Sciences_de_Gestion"]
["U10C","Centre","Université Yahia Farès de Médéa","U. Médéa","Faculté des Sciences Economiques, Commerciales et des Sciences de Gestion","Département des Sciences Economiques","Université_Yahia_Farès_de_MédéaFaculté_des_Sciences_Economiques,_Commerciales_et_des_Sciences_de_Gestion"]
["U10C","Centre","Université Yahia Farès de Médéa","U. Médéa","Faculté des Sciences et de la Technologie","Département de Génie des Procédés","Université_Yahia_Farès_de_MédéaFaculté_des_Sciences_et_de_la_Technologie"]
["U10C","Centre","Université Yahia Farès de Médéa","U. Médéa","Faculté des sciences et de la technologie","Département de Génie Électrique et de l'Informatique","Université_Yahia_Farès_de_MédéaFaculté_des_sciences_et_de_la_technologie"]
["U10C","Centre","Université Yahia Farès de Médéa","U. Médéa","Faculté des Sciences et de la Technologie","Département du Génie de la Matière","Université_Yahia_Farès_de_MédéaFaculté_des_Sciences_et_de_la_Technologie"]
["U11C","Centre","Université Ziane Achour de Djelfa","U. Djelfa","Faculté de Droit et des Sciences Politiques","Département de droit","Université_Ziane_Achour_de_DjelfaFaculté_de_Droit_et_des_Sciences_Politiques"]
["U11C","Centre","Université Ziane Achour de Djelfa","U. Djelfa","Faculté de Droit et des Sciences Politiques","Département des Sciences Politiques","Université_Ziane_Achour_de_DjelfaFaculté_de_Droit_et_des_Sciences_Politiques"]
["U11C","Centre","Université Ziane Achour de Djelfa","U. Djelfa","Faculté des Lettres, des Langues et des Arts",null,"Université_Ziane_Achour_de_DjelfaFaculté_des_Lettres,_des_Langues_et_des_Arts"]
["U11C","Centre","Université Ziane Achour de Djelfa","U. Djelfa","Faculté des Sciences de la Nature et de la Vie ","Département d’Agropastoralisme","Université_Ziane_Achour_de_DjelfaFaculté_des_Sciences_de_la_Nature_et_de_la_Vie_"]
["U11C","Centre","Université Ziane Achour de Djelfa","U. Djelfa","Faculté des Sciences de la Nature et de la Vie ","Département d’Aménagement Urbain","Université_Ziane_Achour_de_DjelfaFaculté_des_Sciences_de_la_Nature_et_de_la_Vie_"]
["U11C","Centre","Université Ziane Achour de Djelfa","U. Djelfa","Faculté des Sciences de la Nature et de la Vie ","Département de biologie ","Université_Ziane_Achour_de_DjelfaFaculté_des_Sciences_de_la_Nature_et_de_la_Vie_"]
["U11C","Centre","Université Ziane Achour de Djelfa","U. Djelfa","Faculté des Sciences Économiques, des Sciences Commerciales et des Sciences de Gestion",null,"Université_Ziane_Achour_de_DjelfaFaculté_des_Sciences_Économiques,_des_Sciences_Commerciales_et_des_Sciences_de_Gestion"]
["U11C","Centre","Université Ziane Achour de Djelfa","U. Djelfa","Faculté des Sciences et de la Technologie",null,"Université_Ziane_Achour_de_DjelfaFaculté_des_Sciences_et_de_la_Technologie"]
["U11C","Centre","Université Ziane Achour de Djelfa","U. Djelfa","Faculté des Sciences Sociales et Humaines",null,"Université_Ziane_Achour_de_DjelfaFaculté_des_Sciences_Sociales_et_Humaines"]
["U11C","Centre","Université Ziane Achour de Djelfa","U. Djelfa","Institut des Sciences et Techniques des Activités Physiques et Sportifs",null,"Université_Ziane_Achour_de_DjelfaInstitut_des_Sciences_et_Techniques_des_Activités_Physiques_et_Sportifs"]
[]
[]
[]
[]
[]
[]
[]
[]
[]
[]
[]
[]
[]
[]
[]
[]
[null,null,null,null,"Centre Universitaire Ain Temouchent"]
[null,null,null,null,"Centre Universitaire El Bayadh"]
[null,null,null,null,"Centre Universitaire Mila"]
[null,null,null,null,"Centre Universitaire Naama"]
[null,null,null,null,"Centre Universitaire Relizane"]
[null,null,null,null,"Centre Universitaire Tipaza"]
[null,null,null,null,"Centre Universitaire Tissemssilt"]
[null,null,null,null,"Ecole des Hautes Etudes Commerciales"]
[null,null,null,null,"Ecole National des Mines Annaba"]
[null,null,null,null,"Ecole Nationale Polytechnique Alger"]
[null,null,null,null,"Ecole Nationale polytechnique Oran"]
[null,null,null,null,"Ecole Nationale Supérieure Agronomie"]
[null,null,null,null,"Ecole Nationale Supérieure d’Hydraulique"]
[null,null,null,null,"Ecole Nationale Supérieure des Sciences Commerciales et Finacieres (ESC)"]
[null,null,null,null,"Ecole Nationale Supérieure des Sciences de la Mer et de l’Aménagement du Littoral"]
[null,null,null,null,"Ecole Nationale Supérieure des Travaux Publics"]
[null,null,null,null,"Ecole Nationale Supérieure en Informatique"]
[null,null,null,null,"Ecole Nationale Supérieure en Sciences et Technologie du Sport"]
[null,null,null,null,"Ecole Nationale Supérieure en Statistique et en Economie Appliquée"]
[null,null,null,null,"Ecole Nationale Vétérinaire"]
[null,null,null,null,"Ecole Normale Superieure de Constantine"]
[null,null,null,null,"Ecole Normale Supérieure de Kouba"]
[null,null,null,null,"Ecole Normale Supérieure de Laghouat"]
[null,null,null,null,"Ecole Normale Supérieure des Lettres et Sciences Sociales - Bouzaréah"]
[null,null,null,null,"Ecole Polytechnique d’Architecteur et d’Urbanisme"]
[null,null,null,null,"Ecole Préparatoire en Sciences Economiques, Commerciales et de Gestion"]
[null,null,null,null,"Institut de Maritime Bousmail "]
[null,null,null,null,"Institut National de la Poste et des TIC "]
[null,null,null,null,"Institut National des Télécommunications et des Technologies de l'Information et de la Communication -Oran"]
[null,null,null,null,"Institut Pasteur d’Algérie"]
[null,null,null,null,"Université 20 Août 1955 de Skikda"]
[null,null,null,null,"Université 8 Mai 1945 de Guelma"]
[null,null,null,null,"Université Abdelhak Benhamouda de Jijel"]
[null,null,null,null,"Université Abdelhamid Ibn Badis de Mostaganem"]
[null,null,null,null,"Université Abderrahmane Mira de Béjaia"]
[null,null,null,null,"Université Aboubeker Belkaid de Tlemcen"]
[null,null,null,null,"Université Africaine Ahmed Draya Adrar"]
[null,null,null,null,"Université Amar Telidji de Laghouat"]
[null,null,null,null,"Université Badji Mokhtar Annaba"]
[null,null,null,null,"Université Benyoucef Benkhedda Alger"]
[null,null,null,null,"Université d'Alger 2"]
[null,null,null,null,"Université d'Alger 3"]
[null,null,null,null,"Université de Béchar"]
[null,null,null,null,"Université de Blida 2"]
[null,null,null,null,"Université de Bordj Bou Arréridj"]
[null,null,null,null,"Université de Bouira"]
[null,null,null,null,"Université de Constantine 2"]
[null,null,null,null,"Université de Constantine 3"]
[null,null,null,null,"Université de Ghardaïa"]
[null,null,null,null,"Université de Khemis Miliana"]
[null,null,null,null,"Université de Khenchela"]
[null,null,null,null,"Université de Mascara"]
[null,null,null,null,"Université de Msila"]
[null,null,null,null,"Université de Sétif 2"]
[null,null,null,null,"Université de Souk Ahras"]
[null,null,null,null,"Université des Sciences et de la Technologie Houari Boumediène"]
[null,null,null,null,"Université des Sciences et de la Technologie Mohamed Boudiaf Oran"]
[null,null,null,null,"Université des Sciences Islamiques Emir Abdelkader de Constantine"]
[null,null,null,null,"Université El Djilali Liabès de Sidi Bel Abbès"]
[null,null,null,null,"Université El Hadj Lakhdar de Batna"]
[null,null,null,null,"Université El Oued"]
[null,null,null,null,"Université El Tarf"]
[null,null,null,null,"Université Es Sénia Oran"]
[null,null,null,null,"Université Ferhat Abbes de Sétif 1"]
[null,null,null,null,"Université Hassiba Ben Bouali de Chlef"]
[null,null,null,null,"Université Ibn Khaldoun de Tiaret"]
[null,null,null,null,"Université Kasdi Merbah de Ouargla"]
[null,null,null,null,"Université Larbi Ben Mhidi de Oum El Bouaghi"]
[null,null,null,null,"Université Larbi Tebessi de Tébessa"]
[null,null,null,null,"Université Mentouri de Constantine 1"]
[null,null,null,null,"Université Mhamed Bougara de Boumerdès"]
[null,null,null,null,"Université Mohamed Khider de Biskra"]
[null,null,null,null,"Université Mouloud Maameri de Tizi Ouzou"]
[null,null,null,null,"Université Saâd Dahlab de Blida 1"]
[null,null,null,null,"Université Tahar Moulay de Saida"]
[null,null,null,null,"Université Yahia Farès de Médéa"]
[null,null,null,null,"Université Ziane Achour de Djelfa"]

{"sheet":"Feuille Excel","index":8,"n_rows":2011,"n_cols":14,"rows_kept":2011,"cut":false,"hidden":true,"merged":[]}
["Grade","Code","Grands domaines (Français)","Grands domaines (Français)","Dernier diplôme obtenu","Sexe"]
["Pr.","GD1","Sciences de la nature et de la vie",{"$f":"CONCATENATE(B2,\": \",C2)","v":"GD1: Sciences de la nature et de la vie"},"Doc. d'Etat","Mr"]
["MCA","GD2","Sciences de la terre et de l’univers",{"$f":"CONCATENATE(B3,\": \",C3)","v":"GD2: Sciences de la terre et de l’univers"},"Doctorat","Mme"]
["MCB","GD3","Sciences de la physique","GD3: Sciences de la physique","DESM","Melle"]
["MAA","GD4","Chimie","GD4: Chimie","Magister"]
["MAB","GD5","Sciences mathématiques et leurs interactions","GD5: Sciences mathématiques et leurs interactions","DEMS"]
["MAA, Doc.","GD6","Sciences pour l’ingénieur","GD6: Sciences pour l’ingénieur","Master"]
["MAB, Doc.","GD7","Sciences sociales","GD7: Sciences sociales"]
["Doc.","GD8","Sciences humaines et arts","GD8: Sciences humaines et arts"]
[null,"GD9","Multidisciplinaire","GD9: Multidisciplinaire"]
[0]
[1,"Code","Micro-domaines_ST","Micro-domaines","Code","Micro-domaines","Micro-domaines_Sciences sociales","Code","Micro-domaines","Micro-domaines_Art et humaines",null,null,"Domaines","Domaines"]
[2,1,"Acoustics","Acoustiques",1,"Anthropology","Anthropologie ","MD179","Archaeology","Archéologie ",null,null,"D1","Physique et Astronomie"]
[3,2,"Agricultural Economics & Policy","Économie agricole et politique",2,"Area Studies","Études des domaines sociaux","MD180","Architecture","Architecture",null,null,"D2","Chimie"]
[4,3,"Agricultural Engineering","Génie agricole",3,"Business","Entreprise ","MD182","Art","Art",null,null,"D3","Mathématiques"]
[5,4,"Agriculture, Dairy & Animal Science","Agriculture, produits laitiers et  science des animaux",4,"Business, Finance","Affaires et Finance","MD183","Asian Studies","Études asiatiques",null,null,"D4","Sciences de la Terre et des Planètes"]
[6,5,"Agriculture, Multidisciplinary","Agriculture, multidisciplinaire",5,"Communication","Communication ","MD186","Classics","Classiques",null,null,"D5","Sciences de l'Environnement"]
[7,6,"Agronomy","Agronomie",6,"Criminology & Penology","Criminologie et pénologie ","MD189","Cultural Studies","Etudes culturelles",null,null,"D6","Sciences des Matériaux"]
[8,7,"Allergy","Allergie",7,"Demography","Démographie ","MD190","Dance","Danse ",null,null,"D7","Energie"]
[9,8,"Anatomy & Morphology","Anatomie et morphologie ",8,"Economics","Économie ","MD200","Film, Radio, Television","Cinéma, Radio, télévision",null,null,"D8","Ingénierie"]
[10,9,"Andrology","Andrologie ",9,"Education & Educational Research","Éducation et recherche en éducation ","MD201","Folklore","Folklore",null,null,"D9","Génie Chimique"]
[11,10,"Anesthesiology","Anesthésiologie ",10,"Education, Special","Éducation spéciale ","MD205","History","Histoire ",null,null,"D10","Informatique"]
[12,11,"Astronomy & Astrophysics","Astronomie et astrophysique ",11,"Environmental Studies","Études environnementales ","MD206","History & Philosophy of Science","Histoire et philosophie des sciences ",null,null,"D11","Dentisterie"]
[13,12,"Audiology Speech Language Pathology","Audiologie et orthophonie",12,"Ergonomics","Ergonomie ","MD209","Sciences, Multidisciplinary","Sciences, multidisciplinaire",null,null,"D12","Professions de la Santé"]
[14,13,"Automation & Control Systems","Automation et systèmes de contrôle ",13,"Ethics","Éthique ","MD214","Language & Linguistics","Langue et la linguistique",null,null,"D13","Médecine"]
[15,14,"Behavioral Sciences","Sciences du comportement ",14,"Ethnic Studies","Études ethniques ","MD217","Literary Reviews","Critiques littéraires",null,null,"D14","Profession d'Infirmier"]
[16,15,"Biochemical Research Methods","Méthodes de recherche biochimique ",15,"Family Studies","Études familiales ","MD218","Literary Theory & Criticism","La théorie littéraire et critique",null,null,"D15","Sciences Vétérinaires"]
[17,16,"Biochemistry & Molecular Biology","Biochimie et biologie moléculaire",16,"Geography","Géographie ","MD219","Literature","Littérature",null,null,"D16","Sciences Sociales"]
[18,17,"Biodiversity Conservation","Conservation de la biodiversité ",17,"Gerontology","Gérontologie ","MD220","Literature, African, Australian, Canadian","Littérature d’Afrique, d’Australie, et canadienne",null,null,"D17","Economie, Econométrie et Finances"]
[19,18,"Biology","Biologie ",18,"Health Policy & Services","La politique de santé et de Services ","MD221","Literature, American","Littérature Américaine",null,null,"D18","Commerce, Gestion et Comptabilité"]
[20,19,"Biophysics","Biophysique ",19,"History","Histoire ","MD222","Literature, British Isles","Littérature des îles britanniques",null,null,"D19","Sciences de la Décision"]
[21,20,"Biotechnology & Applied Microbiology","Biotechnologie et microbiologie appliquée ",20,"History & Philosophy of Science","Histoire et philosophie des sciences ","MD223","Literature, German, Dutch, Scandinavian","Littérature, allemande, néerlandaise et  scandinave",null,null,"D20","Psychologies"]
[22,21,"Cardiac & Cardiovascular Systems","Systèmes cardiaques et cardiovasculaires ",21,"History of Social Sciences","Histoire des Sciences sociales ","MD224","Literature, Romance","Littérature Romane",null,null,"D21","Arts et Sciences Humaines"]
[23,22,"Cell & Tissue Engineering","Biologie cellulaire ",22,"Hospitality, Leisure, Sport & Tourism","Hospitalité, loisirs, Sport et tourisme ","MD225","Literature, Slavic","Littérature Slave",null,null,"D22","Agronomie et Biologie"]
[24,23,"Cell Biology","Cellule et génie tissulaire ",23,"Industrial Relations & Labor","Relations industrielles et travail ","MD227","Medieval & Renaissance Studies","Études médiévales et Renaissance",null,null,"D23","Biochimie, Génétique et biologie moléculaire"]
[25,24,"Chemistry, Analytical","Chimie analytique ",24,"Information Science & Library Science","Sciences de l'information et bibliothéconomie ","MD228","Music","Musique",null,null,"D24","Immunologie et Microbiologie"]
[26,25,"Chemistry, Applied","Chimie appliquée ",25,"International Relations","Relations internationales ","MD230","Philosophy","Philosophie",null,null,"D25","Neurologie"]
[27,26,"Chemistry, Inorganic & Nuclear","Chimie inorganique et nucléaire ",26,"Law","Droit ","MD257","Theater","Théâtre",null,null,"D26","Pharmacologie, Toxicologie et Pharmaceutique"]
[28,27,"Chemistry, Medicinal","Chimie médicinal ",27,"Linguistics","Linguistique ","MD248","Religion","Religion",null,null,"D27","Multidisciplinaire"]
[29,28,"Chemistry, Multidisciplinary","Chimie multidisciplinaire ",28,"Management","Gestion ","MD232","Poetry","Poésie"]
[30,29,"Chemistry, Organic","Chimie organique ",29,"Nursing","Soins infirmiers ","MD256","Tamazight Language and Culture","Littérature et culture tamazight"]
[31,30,"Chemistry, Physical","Chimie physique ",30,"Planning & Development","Planification et développement ","MD178","Arabic Language and Literature","Littérature et langue arabe"]
[32,31,"Clinical Neurology","Neurologie clinique ",31,"Political Science ","Science politique","MD213","Islamic Sciences","Sciences islamiques"]
[33,32,"Computer Science, Artificial Intelligence","Informatique et Intelligence artificielle ",32,"Psychiatry","Psychiatrie ","MD209","Humanities, Multidisciplinary","Humaines, multidisciplinaire"]
[34,33,"Computer Science, Cybernetics","Informatique et Cybernétique ",33,"Psychology, Applied","Psychologie appliquée ","MD247","Rehabilitation","Réhabilitation"]
[35,34,"Computer Science, Hardware & Architecture","Informatique, matériel et Architecture ",34,"Psychology, Biological","Psychologie biologique ","MD255","Substance Abuse","Abus de substances"]
[36,35,"Computer Science, Information Systems","Informatique et systèmes d'Information ",35,"Psychology, Clinical","Psychologie clinique ","MD149","Primary Health Care","Soins de santé primaires"]
[37,36,"Computer Science, Interdisciplinary Applications","Informatique et Applications interdisciplinaires ",36,"Psychology, Developmental","Psychologie du développement "]
[38,37,"Computer Science, Software Engineering","Informatique et génie logiciel ",37,"Psychology, Educational","Psychologie de l’éducation "]
[39,38,"Computer Science, Theory & Methods","Informatique : théorie et méthodes",38,"Psychology, Experimental","Psychologie expérimentale "]
[40,39,"Construction & Building Technology","Construction et technologie du bâtiment ",39,"Psychology, Mathematical","Psychologie mathématique "]
[41,40,"Critical Care Medicine","Médecine des soins intensifs ",40,"Psychology, Multidisciplinary","Psychologie multidisciplinaire "]
[42,41,"Crystallography","Cristallographie ",41,"Psychology, Psychoanalysis","Psychologie et psychanalyse "]
[43,42,"Dentistry, Oral Surgery & Medicine","Dentisterie, chirurgie buccale et médecine ",42,"Psychology, Social","Psychologie sociale "]
[44,43,"Dermatology","Dermatologie ",43,"Public Administration","Administration publique "]
[45,44,"Developmental Biology","Biologie du développement ",44,"Public, Environmental & Occupational Health","Santé publique, environnementale et du travail "]
[46,45,"Ecology","Écologie",45,null,"Réadaption"]
[47,46,"Education, Scientific Disciplines","Éducation, et Disciplines scientifiques ",46,"Social Issues","Questions sociales "]
[48,47,"Electrochemistry","Électrochimie ",47,"Social Sciences, Biomedical","Sciences sociales, biomédicales "]
[49,48,"Emergency Medicine","Médecine d'urgence ",48,"Social Sciences, Interdisciplinary","Sciences sociales, interdisciplinaires "]
[50,49,"Engineering, Aerospace","Ingénierie, aérospatiale",49,"Social Sciences, Mathematical Methods","Sciences sociales et méthodes mathématiques "]
[51,50,"Energy & Fuels","Énergie et carburants ",50,"Social Work","Travail social "]
[52,51,"Endocrinology & Metabolism","Endocrinologie et métabolisme",51,"Sociology","Sociologie "]
[53,52,"Engineering, Biomedical","Génie biomédical ",52,"Women's Studies","Études féminines "]
[54,53,"Engineering, Chemical","Génie chimique ",53,"Transportation","Transports"]
[55,54,"Engineering, Civil","Génie civile ",54,"Urban Studies","Études urbaines"]
[56,55,"Engineering, Electrical & Electronic","Génie électrique et électronique ",55,"Toxicology","Toxicologie "]
[57,56,"Engineering, Environmental","Génie de l’environnement "]
[58,57,"Engineering, Geological","Génie géologique "]
[59,58,"Engineering, Industrial","Génie industriel "]
[60,59,"Engineering, Manufacturing","Génie de fabrication "]
[61,60,"Engineering, Marine","Génie marin "]
[62,61,"Engineering, Mechanical","Génie mécanique "]
[63,62,"Engineering, Multidisciplinary","Ingénierie multidisciplinaire "]
[64,63,"Engineering, Ocean","Ingénierie océane "]
[65,64,"Engineering, Petroleum","Génie du pétrole "]
[66,65,"Entomology","Entomologie "]
[67,66,"Environmental Sciences","Sciences de l'environnement "]
[68,67,"Evolutionary Biology","Biologie de l'évolution "]
[69,68,"Fisheries","Pêche "]
[70,69,"Food Science & Technology","Science des aliments et technologie "]
[71,70,"Forestry","Forêts"]
[72,71,"Gastroenterology & Hepatology","Gastro-entérologie et hépatologie "]
[73,72,"Genetics & Heredity","Génétique et hérédité "]
[74,73,"Geochemistry & Geophysics","Géochimie et géophysique "]
[75,74,"Geography, Physical","Géographie physique"]
[76,75,"Geology","Géologie "]
[77,76,"Geosciences, Multidisciplinary","Sciences de la terre, multidisciplinaires "]
[78,77,"Geriatrics & Gerontology","Gériatrie et gérontologie "]
[79,78,"Health Care Sciences & Services","Sciences de la santé et de Services "]
[80,79,"Hematology","Hématologie "]
[81,80,"History & Philosophy of Science","Histoire et philosophie des sciences "]
[82,81,"Horticulture","Horticulture "]
[83,82,"Imaging Science & Photographic Technology","Science de l’Imagerie et technologie photographique "]
[84,83,"Immunology","Immunologie "]
[85,84,"Infectious Diseases","Maladies infectieuses "]
[86,85,"Instruments & Instrumentation","Instruments et Instrumentation "]
[87,86,"Integrative & Complementary Medicine","Médecine intégrative et complémentaire "]
[88,87,"Limnology","Limnologie "]
[89,88,"Logic","Logique"]
[90,89,"Marine & Freshwater Biology","Biologie marine et d'eau douce "]
[91,90,"Materials Science, Biomaterials","Science des matériaux, biomatériaux "]
[92,91,"Materials Science, Ceramics","Science des matériaux, céramiques"]
[93,92,"Materials Science, Characterization & Testing","Science des matériaux, caractérisation et mise à l'essai "]
[94,93,"Materials Science, Coatings & Films","Science des matériaux, revêtements et Films"]
[95,94,"Materials Science, Composites","Science des matériaux, Composites "]
[96,95,"Materials Science, Multidisciplinary","Science des matériaux, multidisciplinaire "]
[97,96,"Materials Science, Paper & Wood","Science des matériaux, papier et bois "]
[98,97,"Materials Science, Textiles","Science des matériaux, Textiles "]
[99,98,"Mathematical & Computational Biology","Mathématique et informatique en Biologie"]
[100,99,"Mathematics","Mathématiques "]
[101,100,"Mathematics, Applied","Mathématiques appliquées "]
[102,101,"Mathematics, Interdisciplinary Applications","Mathématiques, Applications interdisciplinaires "]
[103,102,"Mechanics","Mécanique "]
[104,103,"Medical Informatics","Informatique médicale"]
[105,104,"Medical Ethics","Éthique médicale "]
[106,105,"Medical Laboratory Technology","Technologie de laboratoire médical "]
[107,106,"Medicine, General & Internal","Médecine générale et interne "]
[108,107,"Medicine, Legal","Médecine légale "]
[109,108,"Medicine, Research & Experimental","Médecine, recherche et expérimentation "]
[110,109,"Metallurgy & Metallurgical Engineering","Métallurgie et génie métallurgique "]
[111,110,"Meteorology & Atmospheric Sciences","Météorologie et Sciences de l’atmosphère "]
[112,111,"Microbiology","Microbiologie "]
[113,112,"Microscopy","Microscopie "]
[114,113,"Mineralogy","Minéralogie "]
[115,114,"Mining & Mineral Processing","Mines et traitement des minéraux "]
[116,115,"Multidisciplinary Sciences","Sciences multidisciplinaires "]
[117,116,"Mycology","Mycologie "]
[118,117,"Nanoscience & Nanotechnology","Nanosciences et nanotechnologies "]
[119,118,"Neuroimaging","Neuro-imagerie "]
[120,119,"Neurosciences","Neurosciences "]
[121,120,"Nuclear Science & Technology","Science nucléaire et technologie "]
[122,121,"Nursing","Soins infirmiers "]
[123,122,"Nutrition & Dietetics","Nutrition et diététique "]
[124,123,"Obstetrics & Gynecology","Obstétrique et gynécologie "]
[125,124,"Oceanography","Océanographie "]
[126,125,"Oncology","Oncologie "]
[127,126,"Operations Research & Management Science","Recherche opérationnelle  et sciences de gestion "]
[128,127,"Ophthalmology","Ophtalmologie "]
[129,128,"Optics","Optique "]
[130,129,"Ornithology","Ornithologie "]
[131,130,"Orthopedics","Orthopédie "]
[132,131,"Otorhinolaryngology","Oto-rhino-laryngologie "]
[133,132,"Paleontology","Paléontologie "]
[134,133,"Parasitology","Parasitologie "]
[135,134,"Pathology","Pathologie "]
[136,135,"Pediatrics","Pédiatrie "]
[137,136,"Peripheral Vascular Disease","Pharmacologie et pharmacie "]
[138,137,"Pharmacology & Pharmacy","Maladies vasculaires périphériques "]
[139,138,"Physics, Applied","Physique, appliquée"]
[140,139,"Physics, Atomic, Molecular & Chemical","Physique atomique et moléculaire et chimique "]
[141,140,"Physics, Condensed Matter","Physique de la matière condensée "]
[142,141,"Physics, Fluids & Plasmas","Physique, fluides et Plasmas "]
[143,142,"Physics, Mathematical","Physique mathématique "]
[144,143,"Physics, Multidisciplinary","Physique, multidisciplinaire "]
[145,144,"Physics, Nuclear","Physique nucléaire "]
[146,145,"Physics, Particles & Fields","Physique des particules et des champs "]
[147,146,"Physiology","Physiologie "]
[148,147,"Plant Sciences","Sciences des plantes "]
[149,148,"Polymer Science","Science des polymères "]
[150,149,"Psychiatry","Psychiatrie "]
[151,150,"Psychology","Psychologie "]
[152,151,"Public, Environmental & Occupational Health","Santé publique, environnementale et du travail "]
[153,152,"Radiology, Nuclear Medicine & Medical Imaging","Radiologie, médecine nucléaire et l'imagerie médicale "]
[154,153,"Rehabilitation","Réhabilitation"]
[155,154,"Remote Sensing","Télédétection "]
[156,155,"Reproductive Biology","Biologie de la reproduction "]
[157,156,"Respiratory System","Système respiratoire "]
[158,157,"Rheumatology","Rhumatologie "]
[159,158,"Robotics","Robotique "]
[160,159,"Soil Science","Science des sols "]
[161,160,"Spectroscopy","Spectroscopie  "]
[162,161,"Sport Sciences","Sciences du sport "]
[163,162,"Statistics & Probability","Statistiques et probabilités "]
[164,163,"Substance Abuse","Abus de substances"]
[165,164,"Surgery","Chirurgie "]
[166,165,"Telecommunications","Télécommunications "]
[167,166,"Thermodynamics","Thermodynamique "]
[168,167,"Toxicology","Toxicologie "]
[169,168,"Transplantation","Transplantation "]
[170,169,"Transportation Science & Technology","Science du Transport et technologie "]
[171,170,"Tropical Medicine","Médecine tropicale "]
[172,171,"Urology & Nephrology","Urologie et néphrologie "]
[173,172,"Veterinary Sciences","Sciences vétérinaires "]
[174,173,"Virology","Virologie "]
[175,174,"Zoology","Zoologie","  "]
[176,175,"Water Resources","Ressources en eau","  "]
[177,null,null,null,"  "]
[178,null,"Intitulé de laboratoire","Etablissement de rattachement","Étiquettes de lignes"]
[179,"Centre_Universitaire_Ain_Temouchent","Hydrologie Appliquée Et Environnement","Centre Universitaire Ain Temouchent","Centre Universitaire Ain Temouchent"]
[180,"Centre_Universitaire_Ain_Temouchent","Structures Intelligentes","Centre Universitaire Ain Temouchent","Centre Universitaire de Tamanrasset"]
[181,"Centre_Universitaire_Ain_Temouchent","Chimie Appliquée","Centre Universitaire Ain Temouchent","Centre Universitaire El Bayadh"]
[182,"Centre_Universitaire_Ain_Temouchent","Discours Communicatif Algérien Moderne : Littéraire, Religieux, Publicitaire, Informatif …Étude Et Analyse","Centre Universitaire Ain Temouchent","Centre Universitaire Mila"]
[183,"Centre_Universitaire_Ain_Temouchent","Marches, Emploi Législation Simulation Au Pays Maghrébine","Centre Universitaire Ain Temouchent","Centre Universitaire Naama"]
[184,"Centre_Universitaire_El_Bayadh","Législations De Protection De Fonction Publique","Centre Universitaire El Bayadh","Centre Universitaire Relizane"]
[185,"Centre_Universitaire_Mila","Mathematiques Et Leurs Interactions","Centre Universitaire Mila","Centre Universitaire Tipaza"]
[186,"Centre_Universitaire_Mila","Sciences Naturelles Et Matériaux","Centre Universitaire Mila","Centre Universitaire Tissemssilt"]
[187,"Centre_Universitaire_Naama","Crimes Transfrontaliers","Centre Universitaire Naama","Ecole des Hautes Etudes Commerciales"]
[188,"Centre_Universitaire_Naama","L'étude du vocabulaire arabe classique des dialectes de l'ouest algérien","Centre Universitaire Naama","Ecole National des Mines Annaba"]
[189,"Centre_Universitaire_Relizane","Environnement, Les Substances Naturelles Végétales Et Technologie Des Aliments","Centre Universitaire Relizane","Ecole Nationale Polytechnique"]
[190,"Centre_Universitaire_Relizane","Génie Industrielle Et Développement Durable.","Centre Universitaire Relizane","Ecole Nationale polytechnique ENSET Oran"]
[191,"Centre_Universitaire_Relizane","Gestion Des Marches Financiers Par L’Application Des Mathématiques Et L’Informatique","Centre Universitaire Relizane","Ecole Nationale Supérieure Agronomie"]
[192,"Centre_Universitaire_Relizane","Etudes Sociales, Psychologiques Et Anthropologiques","Centre Universitaire Relizane","Ecole nationale supérieure de journalisme et des sciences de information"]
[193,"Centre_Universitaire_Relizane","Langue Et Communication","Centre Universitaire Relizane","Ecole Nationale Supérieure des Sciences Commerciales et Finacieres ESC"]
[194,"Centre_Universitaire_Tipaza","Economie Et Développement","Centre Universitaire Tipaza","Ecole Nationale Supérieure des Sciences de la Mer et de Aménagement du Littoral"]
[195,"Centre_Universitaire_Tipaza","Etudes En Culture, Personnalité Et Développement","Centre Universitaire Tipaza","Ecole Nationale Supérieure des Travaux Publics"]
[196,"Centre_Universitaire_Tipaza","Géographie Économique Et Les Échanges Internationaux","Centre Universitaire Tipaza","Ecole Nationale Supérieure en Informatique"]
[197,"Centre_Universitaire_Tipaza","des pratiques culturelles,enseignantes et d'apprentissage en algerie ","Centre Universitaire Tipaza","Ecole Nationale Supérieure en Sciences et Technologie du Sport"]
[198,"Centre_Universitaire_Tipaza","Institutions constitutionnelles    et le système politique","Centre Universitaire Tipaza","Ecole Nationale Supérieure en Statistique et en Economie Appliquée"]
[199,"Centre_Universitaire_Tissemssilt","Mesure Et Évaluation Des Activités Sportives","Centre Universitaire Tissemssilt","Ecole Nationale Supérieure Hydraulique"]
[200,"Centre_Universitaire_Tissemssilt","Etudes Critiques et Littéraires Modernes ","Centre Universitaire Tissemssilt","Ecole Nationale Supérieure Informatique Sidi Bel Abbes"]
[201,"Ecole_des_Hautes_Etudes_Commerciales","Management, Performance Et Innovation","Ecole des Hautes Etudes Commerciales","Ecole Nationale Vétérinaire"]
[202,"Ecole_des_Hautes_Etudes_Commerciales","Marketing Et Technologies De L'Information Et De La Communication","Ecole des Hautes Etudes Commerciales","Ecole Normale Superieure de Constantine"]
[203,"Ecole_National_des_Mines_Annaba","Mines, Métallurgie Et Matériaux","Ecole National des Mines Annaba","Ecole Normale Supérieure de Kouba"]
[204,"Ecole_Nationale_Polytechnique","Commande Des Processus","Ecole Nationale Polytechnique","Ecole Normale Supérieure de Laghouat"]
[205,"Ecole_Nationale_Polytechnique","Dispositifs De Communication Et De Conversion Photovoltaïque","Ecole Nationale Polytechnique","Ecole Normale Supérieure des Lettres et Sciences Sociales Bouzaréah"]
[206,"Ecole_Nationale_Polytechnique","Electrotechnique","Ecole Nationale Polytechnique","Ecole Polytechnique Architecteur et Urbanisme"]
[207,"Ecole_Nationale_Polytechnique","Génie Mécanique Et Développement","Ecole Nationale Polytechnique","Ecole Préparatoire en Sciences Economiques Commerciales et de Gestion"]
[208,"Ecole_Nationale_Polytechnique","Génie Sismique Et Dynamique Des Structures","Ecole Nationale Polytechnique","Institut de Maritime Bousmail"]
[209,"Ecole_Nationale_Polytechnique","Sciences De L'Eau","Ecole Nationale Polytechnique","Institut National de la Poste et des TIC"]
[210,"Ecole_Nationale_Polytechnique","Sciences Et Génie Des Matériaux","Ecole Nationale Polytechnique","Institut National des Télécommunications et des Technologies de Information et de la Communication Oran"]
[211,"Ecole_Nationale_Polytechnique","Sciences Et Techniques De L'Environnement","Ecole Nationale Polytechnique","Institut Pasteur Algérie"]
[212,"Ecole_Nationale_Polytechnique","Signal Et Communications","Ecole Nationale Polytechnique","Université 20 Août 1955 de Skikda"]
[213,"Ecole_Nationale_Polytechnique","Valorisation Des Énergies Fossiles","Ecole Nationale Polytechnique","Université 8 mai 1945 de Guelma"]
[214,"Ecole_Nationale_Polytechnique","Génie Minier","Ecole Nationale Polytechnique","Université Abdelhamid Ibn Badis de Mostaganem"]
[215,"Ecole_Nationale_polytechnique_ENSET_Oran","Automatique Et Analyse Des Systèmes","Ecole Nationale polytechnique ENSET Oran","Université Abderrahmane Mira de Béjaia"]
[216,"Ecole_Nationale_polytechnique_ENSET_Oran","Caractérisation Et Simulation Des Composants Et Circuits Électroniques","Ecole Nationale polytechnique ENSET Oran","Université Abou Elkacem Saad Allah Alger 2"]
[217,"Ecole_Nationale_polytechnique_ENSET_Oran","Technologie De L'Environnement","Ecole Nationale polytechnique ENSET Oran","Université Aboubeker Belkaid de Tlemcen"]
[218,"Ecole_Nationale_polytechnique_ENSET_Oran","Technologie En Fabrication Mécanique","Ecole Nationale polytechnique ENSET Oran","Université Ahmed Ben Bella Es Senia Oran 1"]
[219,"Ecole_Nationale_polytechnique_ENSET_Oran","Matériaux","Ecole Nationale polytechnique ENSET Oran","Université Ahmed Bougara dit Si Mhamed de Boumerdès"]
[220,"Ecole_Nationale_polytechnique_ENSET_Oran","Simulation, Commande, Analyse Et Maintenance Des Réseaux Eléctriques","Ecole Nationale polytechnique ENSET Oran","Université Ahmed Draya Adrar"]
[221,"Ecole_Nationale_polytechnique_ENSET_Oran","Innovation Des Systèmes Et Produits Industriels","Ecole Nationale polytechnique ENSET Oran","Université Akli Mohand Oulhadj de Bouira"]
[222,"Ecole_Nationale_polytechnique_ENSET_Oran","Micro Et De Nanophysique","Ecole Nationale polytechnique ENSET Oran","Université Alger 3"]
[223,"Ecole_Nationale_polytechnique_ENSET_Oran","Biomécanique Appliquée Et Biomatériaux","Ecole Nationale polytechnique ENSET Oran","Université Badji Mokhtar de Annaba"]
[224,"Ecole_Nationale_Supérieure_Agronomie","Protection Des Végétaux En Milieux Agricoles Et Naturels","Ecole Nationale Supérieure Agronomie","Université Batna 2"]
[225,"Ecole_Nationale_Supérieure_Agronomie","Conservation, Gestion Et Amélioration Des Ecosystèmes Forestiers","Ecole Nationale Supérieure Agronomie","Université Benyoucef Benkhedda Alger"]
[226,"Ecole_Nationale_Supérieure_Agronomie","Maîtrise De L'Eau En Agriculture","Ecole Nationale Supérieure Agronomie","Université Chadli Bendjedid El Tarf"]
[227,"Ecole_Nationale_Supérieure_Agronomie","Mécanisation Agricole","Ecole Nationale Supérieure Agronomie","Université de Abdelhamid Mehri de Constantine 2"]
[228,"Ecole_Nationale_Supérieure_Agronomie","Phytopathologie Et Biologie Moléculaire","Ecole Nationale Supérieure Agronomie","Université de Constantine 3"]
[229,"Ecole_Nationale_Supérieure_Agronomie","Production Animale","Ecole Nationale Supérieure Agronomie","Université de Ghardaïa"]
[230,"Ecole_Nationale_Supérieure_Agronomie","Production Végétale","Ecole Nationale Supérieure Agronomie","Université de Khenchela"]
[231,"Ecole_Nationale_Supérieure_Agronomie","Ressources Génétiques Et Biotechnologies","Ecole Nationale Supérieure Agronomie","Université des Sciences et de la Technologie Houari Boumediène USTHB"]
[232,"Ecole_Nationale_Supérieure_Agronomie","Technologie Alimentaire Et Nutrition Humaine","Ecole Nationale Supérieure Agronomie","Université des Sciences et de la Technologie Mohamed Boudiaf Oran"]
[233,"Ecole_Nationale_Supérieure_Agronomie","Economie Agricole, Agroalimentaire Et Rurale Et De L'Environnement","Ecole Nationale Supérieure Agronomie","Université des Sciences Islamiques Emir Abdelkader de Constantine"]
[234,"Ecole_Nationale_Supérieure_Agronomie","Amélioration Intégrative des Productions Végétales","Ecole Nationale Supérieure Agronomie","Université El Djilali Bounaama dit Si Mhamed de Khemis Miliana"]
[235,"Ecole_nationale_supérieure_de_journalisme_et_des_sciences_de_information","Médias Usages sociaux et communication","Ecole nationale supérieure de journalisme et des sciences de information","Université El Djilali Liabès de Sidi Bel Abbès"]
[236,"Ecole_Nationale_Supérieure_des_Sciences_Commerciales_et_Finacieres_ESC","Systèmes D'Informations Comptables. Etudes Pratiques En Sciences Commerciales Et Sciences De Gestion","Ecole Nationale Supérieure des Sciences Commerciales et Finacieres ESC","Université El Hadj Lakhdar de Batna 1"]
[237,"Ecole_Nationale_Supérieure_des_Sciences_Commerciales_et_Finacieres_ESC","Réformes Économiques, Développement Et Stratégies D'Intégration En Économie Mondiale","Ecole Nationale Supérieure des Sciences Commerciales et Finacieres ESC","Université Ferhat Abbes de Sétif 1"]
[238,"Ecole_Nationale_Supérieure_des_Sciences_Commerciales_et_Finacieres_ESC","Management, Gouvernance, Innovation Et Performance Des Organisations","Ecole Nationale Supérieure des Sciences Commerciales et Finacieres ESC","Université Frères Mentouri de Constantine 1"]
[239,"Ecole_Nationale_Supérieure_des_Sciences_de_la_Mer_et_de_Aménagement_du_Littoral","Conservation Et Valorisation Des Ressources Marines","Ecole Nationale Supérieure des Sciences de la Mer et de Aménagement du Littoral","Université Hassiba Ben Bouali de Chlef"]
[240,"Ecole_Nationale_Supérieure_des_Sciences_de_la_Mer_et_de_Aménagement_du_Littoral","Ecosystèmes Marins Et Littoraux","Ecole Nationale Supérieure des Sciences de la Mer et de Aménagement du Littoral","Université Ibn Khaldoun de Tiaret"]
[241,"Ecole_Nationale_Supérieure_des_Travaux_Publics","Travaux Publics, Ingénierie Du Transport Et Environnement","Ecole Nationale Supérieure des Travaux Publics","Université Kasdi Merbah de Ouargla"]
[242,"Ecole_Nationale_Supérieure_en_Informatique","Méthodes De Conception De Systèmes","Ecole Nationale Supérieure en Informatique","Université Lamine Debaghine de Sétif 2"]
[243,"Ecole_Nationale_Supérieure_en_Informatique","Communication Dans Les Systèmes Informatiques","Ecole Nationale Supérieure en Informatique","Université Larbi Ben Mhidi de Oum El Bouaghi"]
[244,"Ecole_Nationale_Supérieure_en_Sciences_et_Technologie_du_Sport","Sciences Biologiques Appliquées Au Sport (Changement D’Intitulé Du Lr 2001 : Adaptations Et Performance Motrice)","Ecole Nationale Supérieure en Sciences et Technologie du Sport","Université Larbi Tebessi de Tébessa"]
[245,"Ecole_Nationale_Supérieure_en_Sciences_et_Technologie_du_Sport","Sciences Sociales Appliquées Au Sport","Ecole Nationale Supérieure en Sciences et Technologie du Sport","Université Lounici Ali de Blida 2"]
[246,"Ecole_Nationale_Supérieure_en_Sciences_et_Technologie_du_Sport","Technologie De L'Entrainement Sportif","Ecole Nationale Supérieure en Sciences et Technologie du Sport","Université Mohamed Ben Ahmed Oran 2"]
[247,"Ecole_Nationale_Supérieure_en_Statistique_et_en_Economie_Appliquée","Economie Quantitative Appliquée Au Développement","Ecole Nationale Supérieure en Statistique et en Economie Appliquée","Université Mohamed Boudiaf de Msila"]
[248,"Ecole_Nationale_Supérieure_en_Statistique_et_en_Economie_Appliquée","Intégration Régionale Et Union Européenne","Ecole Nationale Supérieure en Statistique et en Economie Appliquée","Université Mohamed Cherif Mesaadia de Souk Ahras"]
[249,"Ecole_Nationale_Supérieure_en_Statistique_et_en_Economie_Appliquée","Modélisation De Phénomènes Stochastiques","Ecole Nationale Supérieure en Statistique et en Economie Appliquée","Université Mohamed El Bachir El Ibrahimi de Bordj Bou Arréridj"]
[250,"Ecole_Nationale_Supérieure_en_Statistique_et_en_Economie_Appliquée","Statistique Appliquée","Ecole Nationale Supérieure en Statistique et en Economie Appliquée","Université Mohamed Essedik Ben Yahia de Jijel"]
[251,"Ecole_Nationale_Supérieure_en_Statistique_et_en_Economie_Appliquée","Gouvernance, Économie Institutionnelle, Et Croissance Durable.","Ecole Nationale Supérieure en Statistique et en Economie Appliquée","Université Mohamed Khider de Biskra"]
[252,"Ecole_Nationale_Supérieure_Hydraulique","Mobilisation Et Evaluation Des Ressources En Eau","Ecole Nationale Supérieure Hydraulique","Université Mohamed Lakhdar Ben Amara dit Hamma Lakhdar El Oued"]
[253,"Ecole_Nationale_Supérieure_Hydraulique","Génie De L'Eau Et De L'Environnement","Ecole Nationale Supérieure Hydraulique","Université Mouloud Maameri de Tizi Ouzou"]
[254,"Ecole_Nationale_Supérieure_Informatique_Sidi_Bel_Abbes","Informatique de Sidi Bel Abbes","Ecole Nationale Supérieure Informatique Sidi Bel Abbes","Université Mustapha Stambouli de Mascara"]
[255,"Ecole_Nationale_Vétérinaire","Santé Et Production Animale","Ecole Nationale Vétérinaire","Université Omar Telidji de Laghouat"]
[256,"Ecole_Nationale_Vétérinaire","Hygiène Alimentaire Et Système Assurance Qualité","Ecole Nationale Vétérinaire","Université Saad Dahlab de Blida 1"]
[257,"Ecole_Nationale_Vétérinaire","Gestion des Ressources Animales Locales","Ecole Nationale Vétérinaire","Université Tahar Moulay de Saida"]
[258,"Ecole_Normale_Superieure_de_Constantine","Didactique Du Français","Ecole Normale Superieure de Constantine","Université Tahri Mohamed de Béchar"]
[259,"Ecole_Normale_Superieure_de_Constantine","Formation Des Sociétés Et Dynamique Des Territoires","Ecole Normale Superieure de Constantine","Université Yahia Farès de Médéa"]
[260,"Ecole_Normale_Superieure_de_Constantine","Mathématiques Appliquées et Didactique","Ecole Normale Superieure de Constantine","Université Ziane Achour de Djelfa"]
[261,"Ecole_Normale_Supérieure_de_Kouba","Didactique Des Sciences (Biologie, Chimie, Mathématiques Et Physique)","Ecole Normale Supérieure de Kouba"]
[262,"Ecole_Normale_Supérieure_de_Kouba","Equations Aux Dérivées Partielles Non Linéaires Et Histoire Des Mathématiques","Ecole Normale Supérieure de Kouba"]
[263,"Ecole_Normale_Supérieure_de_Kouba","Produits Bioactifs Et Valorisation De La Biomasse","Ecole Normale Supérieure de Kouba"]
[264,"Ecole_Normale_Supérieure_de_Kouba","Systèmes Intégrés À Base De Capteurs","Ecole Normale Supérieure de Kouba"]
[265,"Ecole_Normale_Supérieure_de_Kouba","Biologie Et Physiologie Animale","Ecole Normale Supérieure de Kouba"]
[266,"Ecole_Normale_Supérieure_de_Kouba","Physique Des Particules Et Physique Statistique","Ecole Normale Supérieure de Kouba"]
[267,"Ecole_Normale_Supérieure_de_Kouba","Etude Et Développement Des Techniques De Traitement Et D'Épuration Des Eaux Et De Gestion Environnementale","Ecole Normale Supérieure de Kouba"]
[268,"Ecole_Normale_Supérieure_de_Kouba","N-Corps Et Structure De La Matière","Ecole Normale Supérieure de Kouba"]
[269,"Ecole_Normale_Supérieure_de_Kouba","Théorie Du Point Fixe Et Applications","Ecole Normale Supérieure de Kouba"]
[270,"Ecole_Normale_Supérieure_de_Kouba","Biologie Des Systemes Microbiens","Ecole Normale Supérieure de Kouba"]
[271,"Ecole_Normale_Supérieure_de_Kouba","Ecobiologie Animale","Ecole Normale Supérieure de Kouba"]
[272,"Ecole_Normale_Supérieure_de_Kouba","Epistemologie Et Histoire Des Mathematiques","Ecole Normale Supérieure de Kouba"]
[273,"Ecole_Normale_Supérieure_de_Kouba","Ethnobotanique Et Substance Naturelle","Ecole Normale Supérieure de Kouba"]
[274,"Ecole_Normale_Supérieure_de_Kouba","Physique Mathématique Et Applications","Ecole Normale Supérieure de Kouba"]
[275,"Ecole_Normale_Supérieure_de_Laghouat","Sciences Chimiques Et Physiques Appliquées","Ecole Normale Supérieure de Laghouat"]
[276,"Ecole_Normale_Supérieure_des_Lettres_et_Sciences_Sociales_Bouzaréah","Histoire, Civilisation Et Géographie Appliquées","Ecole Normale Supérieure des Lettres et Sciences Sociales Bouzaréah"]
[277,"Ecole_Normale_Supérieure_des_Lettres_et_Sciences_Sociales_Bouzaréah","Science D’Apprentissage De La Langue Arabe","Ecole Normale Supérieure des Lettres et Sciences Sociales Bouzaréah"]
[278,"Ecole_Normale_Supérieure_des_Lettres_et_Sciences_Sociales_Bouzaréah","Education Et Épistémologie","Ecole Normale Supérieure des Lettres et Sciences Sociales Bouzaréah"]
[279,"Ecole_Normale_Supérieure_des_Lettres_et_Sciences_Sociales_Bouzaréah","Enseignement, Formation Et Didactique","Ecole Normale Supérieure des Lettres et Sciences Sociales Bouzaréah"]
[280,"Ecole_Normale_Supérieure_des_Lettres_et_Sciences_Sociales_Bouzaréah","Linguistique Et Sociodidactique Du Plurilinguisme","Ecole Normale Supérieure des Lettres et Sciences Sociales Bouzaréah"]
[281,"Ecole_Normale_Supérieure_des_Lettres_et_Sciences_Sociales_Bouzaréah","Des Etudes Historiques Contemporaines ","Ecole Normale Supérieure des Lettres et Sciences Sociales Bouzaréah"]
[282,"Ecole_Polytechnique_d’Architecteur_et_Urbanisme","Architecture Et Environnement","Ecole Polytechnique Architecteur et Urbanisme"]
[283,"Ecole_Polytechnique_d’Architecteur_et_Urbanisme","Ville, Urbanisme Et Développement Durable","Ecole Polytechnique Architecteur et Urbanisme"]
[284,"Ecole_Polytechnique_d’Architecteur_et_Urbanisme","Ville, Architecture Et Patrimoine","Ecole Polytechnique Architecteur et Urbanisme"]
[285,"Ecole_Préparatoire_en_Sciences_Economiques_Commerciales_et_de_Gestion","Economie Appliquée À L Entreprise","Ecole Préparatoire en Sciences Economiques Commerciales et de Gestion"]
[286,"Institut_de_Maritime_Bousmail","Sécurité Dans Le Transport Maritime","Institut de Maritime Bousmail"]
[287,"Institut_National_de_la_Poste_et_des_TIC","Recherche En Tic","Institut National de la Poste et des TIC"]
[288,"Institut_National_des_Télécommunications_et_des_Technologies_de_Information_et_de_la_Communication_Oran","Recherche Appliquée En Tic","Institut National des Télécommunications et des Technologies de Information et de la Communication Oran"]
[289,"Institut_Pasteur_Algérie","Immuno-Pathologie Et Immuno-Génétique","Institut Pasteur Algérie"]
[290,"Institut_Pasteur_Algérie","Parasitologie","Institut Pasteur Algérie"]
[291,"Université_20_Août_1955_de_Skikda","Génie Chimique Et Environnement De Skikda","Université 20 Août 1955 de Skikda"]
[292,"Université_20_Août_1955_de_Skikda","Physico-Chimie Des Surfaces Et Interfaces","Université 20 Août 1955 de Skikda"]
[293,"Université_20_Août_1955_de_Skikda","Automatique De Skikda","Université 20 Août 1955 de Skikda"]
[294,"Université_20_Août_1955_de_Skikda","Electronique De Skikda","Université 20 Août 1955 de Skikda"]
[295,"Université_20_Août_1955_de_Skikda","Economie, Finances Et Management","Université 20 Août 1955 de Skikda"]
[296,"Université_20_Août_1955_de_Skikda","Matériaux, Géotechnique, Habitat Et Urbanisme (L.M.G.H.U.)","Université 20 Août 1955 de Skikda"]
[297,"Université_20_Août_1955_de_Skikda","Electrotechnique De Skikda","Université 20 Août 1955 de Skikda"]
[298,"Université_20_Août_1955_de_Skikda","Recherches Et Études Sociales","Université 20 Août 1955 de Skikda"]
[299,"Université_20_Août_1955_de_Skikda","Génie Mécanique Et Matériaux","Université 20 Août 1955 de Skikda"]
[300,"Université_20_Août_1955_de_Skikda","Mathématiques Appliquées Et D’Histoire Et Didactique Des Mathématiques","Université 20 Août 1955 de Skikda"]
[301,"Université_20_Août_1955_de_Skikda","Optimisation De La Production Agricole En Zone Subhumide","Université 20 Août 1955 de Skikda"]
[302,"Université_20_Août_1955_de_Skikda","Informatique Et Communication","Université 20 Août 1955 de Skikda"]
[303,"Université_20_Août_1955_de_Skikda","Transport Maritime Et Ports En Algérie","Université 20 Août 1955 de Skikda"]
[304,"Université_20_Août_1955_de_Skikda","Le Patrimoine Littéraire Algérien Officiel Et Marginal","Université 20 Août 1955 de Skikda"]
[305,"Université_8_mai_1945_de_Guelma","Génie Électrique","Université 8 mai 1945 de Guelma"]
[306,"Université_8_mai_1945_de_Guelma","Analyses Industrielles Et Génie Des Matériaux","Université 8 mai 1945 de Guelma"]
[307,"Université_8_mai_1945_de_Guelma","Automatique Et Informatique De Guelma","Université 8 mai 1945 de Guelma"]
[308,"Université_8_mai_1945_de_Guelma","Chimie Appliquée","Université 8 mai 1945 de Guelma"]
[309,"Université_8_mai_1945_de_Guelma","Génie Civil Et Hydraulique","Université 8 mai 1945 de Guelma"]
[310,"Université_8_mai_1945_de_Guelma","Mécanique Et Structure","Université 8 mai 1945 de Guelma"]
[311,"Université_8_mai_1945_de_Guelma","Physique De Guelma","Université 8 mai 1945 de Guelma"]
[312,"Université_8_mai_1945_de_Guelma","Développement Endogène, Auto - Développement Et Bonne Gouvernance","Université 8 mai 1945 de Guelma"]
[313,"Université_8_mai_1945_de_Guelma","Biologie, Eau Et Environnement","Université 8 mai 1945 de Guelma"]
[314,"Université_8_mai_1945_de_Guelma","Histoire Des Recherches Et Études Maghrébines","Université 8 mai 1945 de Guelma"]
[315,"Université_8_mai_1945_de_Guelma","Mathématiques Appliqués Et De Modélisation","Université 8 mai 1945 de Guelma"]
[316,"Université_8_mai_1945_de_Guelma","Problèmes Inverses, Modélisation, Information Et Systèmes (Pi:Mis)","Université 8 mai 1945 de Guelma"]
[317,"Université_8_mai_1945_de_Guelma","Sciences Et Techniques De L'Information Et De La Communication","Université 8 mai 1945 de Guelma"]
[318,"Université_8_mai_1945_de_Guelma","Télécommunications","Université 8 mai 1945 de Guelma"]
[319,"Université_8_mai_1945_de_Guelma","Chimie Computationnelle Et Nanostructures","Université 8 mai 1945 de Guelma"]
[320,"Université_8_mai_1945_de_Guelma","Chimie Physique","Université 8 mai 1945 de Guelma"]
[321,"Université_8_mai_1945_de_Guelma","Conservation Des Zones Humides","Université 8 mai 1945 de Guelma"]
[322,"Université_8_mai_1945_de_Guelma","Etudes Juridiques Environnementales","Université 8 mai 1945 de Guelma"]
[323,"Université_8_mai_1945_de_Guelma","Etudes Linguistiques Et Litturatures","Université 8 mai 1945 de Guelma"]
[324,"Université_8_mai_1945_de_Guelma","Physique Des Matériaux","Université 8 mai 1945 de Guelma"]
[325,"Université_8_mai_1945_de_Guelma","Contrôle Avancé","Université 8 mai 1945 de Guelma"]
[326,"Université_8_mai_1945_de_Guelma","Mécanique Appliquèe Des Nouveau Matèriaux","Université 8 mai 1945 de Guelma"]
[327,"Université_8_mai_1945_de_Guelma","Silicates, Polymères Et Des Nano Composites","Université 8 mai 1945 de Guelma"]
[328,"Université_Abdelhamid_Ibn_Badis_de_Mostaganem","Electromagnétisme Et Optique Guidée","Université Abdelhamid Ibn Badis de Mostaganem"]
[329,"Université_Abdelhamid_Ibn_Badis_de_Mostaganem","Matériaux Et Procédés De Construction","Université Abdelhamid Ibn Badis de Mostaganem"]
[330,"Université_Abdelhamid_Ibn_Badis_de_Mostaganem","Microbiologie Et Biologie Végétale","Université Abdelhamid Ibn Badis de Mostaganem"]
[331,"Université_Abdelhamid_Ibn_Badis_de_Mostaganem","Optimisation Des Programmes D'Activité Sportive : Enseignement Et Entraînement","Université Abdelhamid Ibn Badis de Mostaganem"]
[332,"Université_Abdelhamid_Ibn_Badis_de_Mostaganem","Sciences Et Techniques De L'Environnement Et De La Valorisation","Université Abdelhamid Ibn Badis de Mostaganem"]
[333,"Université_Abdelhamid_Ibn_Badis_de_Mostaganem","Sciences Et Techniques De Production Animale","Université Abdelhamid Ibn Badis de Mostaganem"]
[334,"Université_Abdelhamid_Ibn_Badis_de_Mostaganem","Biodiversité Et Conservation Des Eaux Et Des Sols","Université Abdelhamid Ibn Badis de Mostaganem"]
[335,"Université_Abdelhamid_Ibn_Badis_de_Mostaganem","Dynamique Macro-Économique Et Changements Structurels","Université Abdelhamid Ibn Badis de Mostaganem"]
[336,"Université_Abdelhamid_Ibn_Badis_de_Mostaganem","Mathématiques Pures Et Appliquées","Université Abdelhamid Ibn Badis de Mostaganem"]
[337,"Université_Abdelhamid_Ibn_Badis_de_Mostaganem","Physiologie Animale Appliquée","Université Abdelhamid Ibn Badis de Mostaganem"]
[338,"Université_Abdelhamid_Ibn_Badis_de_Mostaganem","Protection Des Végétaux","Université Abdelhamid Ibn Badis de Mostaganem"]
[339,"Université_Abdelhamid_Ibn_Badis_de_Mostaganem","Signaux Et Systèmes","Université Abdelhamid Ibn Badis de Mostaganem"]
[340,"Université_Abdelhamid_Ibn_Badis_de_Mostaganem","Technologie Alimentaire Et Nutrition","Université Abdelhamid Ibn Badis de Mostaganem"]
[341,"Université_Abdelhamid_Ibn_Badis_de_Mostaganem","Valorisation Des Matériaux","Université Abdelhamid Ibn Badis de Mostaganem"]
[342,"Université_Abdelhamid_Ibn_Badis_de_Mostaganem","Structure, Élaboration Et Applications Des Matériaux Moléculaires","Université Abdelhamid Ibn Badis de Mostaganem"]
[343,"Université_Abdelhamid_Ibn_Badis_de_Mostaganem","Modélisation Numérique Et Expérimentale Des Phénomènes Mécaniques","Université Abdelhamid Ibn Badis de Mostaganem"]
[344,"Université_Abdelhamid_Ibn_Badis_de_Mostaganem","Analyse Des Données Quantitatives Et Qualitatives Des Comportements Psychologiques Et Sociaux","Université Abdelhamid Ibn Badis de Mostaganem"]
[345,"Université_Abdelhamid_Ibn_Badis_de_Mostaganem","Construction, Transport Et Protection De L'Environnement (Lr/Ctpe)","Université Abdelhamid Ibn Badis de Mostaganem"]
[346,"Université_Abdelhamid_Ibn_Badis_de_Mostaganem","Elaboration Et Caractérisation Physico Mécanique Et Métallurgique Des Matériaux","Université Abdelhamid Ibn Badis de Mostaganem"]
[347,"Université_Abdelhamid_Ibn_Badis_de_Mostaganem","Micro-Organismes Bénéfiques, Des Aliments Fonctionnels Et De La Santé","Université Abdelhamid Ibn Badis de Mostaganem"]
[348,"Université_Abdelhamid_Ibn_Badis_de_Mostaganem","Politique Industrielle Et Developpement Des Echanges Exterieurs (Poidex)","Université Abdelhamid Ibn Badis de Mostaganem"]
[349,"Université_Abdelhamid_Ibn_Badis_de_Mostaganem","Dialogue Des Civilisations Et La Diversité Culturelle Et Philosophie De La Paix","Université Abdelhamid Ibn Badis de Mostaganem"]
[350,"Université_Abdelhamid_Ibn_Badis_de_Mostaganem","Didactique Des Projets De Formation Et Conception De Curricula","Université Abdelhamid Ibn Badis de Mostaganem"]
[351,"Université_Abdelhamid_Ibn_Badis_de_Mostaganem","Droit Foncier Et Environnement","Université Abdelhamid Ibn Badis de Mostaganem"]
[352,"Université_Abdelhamid_Ibn_Badis_de_Mostaganem","Droit International Du Développement Durable","Université Abdelhamid Ibn Badis de Mostaganem"]
[353,"Université_Abdelhamid_Ibn_Badis_de_Mostaganem","Etudes Linguistiques Et Littéraires En Algérie, De La Période Turque À La Fin Du Xxe Siècle","Université Abdelhamid Ibn Badis de Mostaganem"]
[354,"Université_Abdelhamid_Ibn_Badis_de_Mostaganem","Philosophie Et Sciences Humaines : Approches Cognitives Et Méthodologiques","Université Abdelhamid Ibn Badis de Mostaganem"]
[355,"Université_Abdelhamid_Ibn_Badis_de_Mostaganem","Sciences Appliquées Au Mouvement Humain","Université Abdelhamid Ibn Badis de Mostaganem"]
[356,"Université_Abdelhamid_Ibn_Badis_de_Mostaganem","Unité De Recherche: Lithiases Urinaires Et Biliaires","Université Abdelhamid Ibn Badis de Mostaganem"]
[357,"Université_Abdelhamid_Ibn_Badis_de_Mostaganem","Environnement Linguistique Et Usages De La Langue Francaise En Algerie:Une Observation Quantitative","Université Abdelhamid Ibn Badis de Mostaganem"]
[358,"Université_Abdelhamid_Ibn_Badis_de_Mostaganem","Esthétiques Visuelles Dans Les Pratique Artistiques Algerériennes","Université Abdelhamid Ibn Badis de Mostaganem"]
[359,"Université_Abdelhamid_Ibn_Badis_de_Mostaganem","Etudes En Communication, Information Et Analyse De Discours","Université Abdelhamid Ibn Badis de Mostaganem"]
[360,"Université_Abdelhamid_Ibn_Badis_de_Mostaganem","Nèo-Khaldounisme,Institutions Sociales Et Pouvoir","Université Abdelhamid Ibn Badis de Mostaganem"]
[361,"Université_Abdelhamid_Ibn_Badis_de_Mostaganem","Pharmacognosie & Api- Phytothérapie","Université Abdelhamid Ibn Badis de Mostaganem"]
[362,"Université_Abdelhamid_Ibn_Badis_de_Mostaganem","Téchnologie Et Proprietés Du Solide","Université Abdelhamid Ibn Badis de Mostaganem"]
[363,"Université_Abdelhamid_Ibn_Badis_de_Mostaganem","Dimensions Sociopragmatique et Pragmalinguistique dans les Manuels Scolaires de Langues Etrangeres en Algérie","Université Abdelhamid Ibn Badis de Mostaganem"]
[364,"Université_Abdelhamid_Ibn_Badis_de_Mostaganem","Droit Constitutionnel et la Bonne Gouvernance","Université Abdelhamid Ibn Badis de Mostaganem"]
[365,"Université_Abdelhamid_Ibn_Badis_de_Mostaganem","Droit de l'Homme et Liberties Publiques","Université Abdelhamid Ibn Badis de Mostaganem"]
[366,"Université_Abdelhamid_Ibn_Badis_de_Mostaganem","Droit de Travail et l’Emploi","Université Abdelhamid Ibn Badis de Mostaganem"]
[367,"Université_Abdelhamid_Ibn_Badis_de_Mostaganem","Etudes du Genres, Langues et Diversités Sociolinguistiques","Université Abdelhamid Ibn Badis de Mostaganem"]
[368,"Université_Abdelhamid_Ibn_Badis_de_Mostaganem","Le Sacré, Expressions et Représentations","Université Abdelhamid Ibn Badis de Mostaganem"]
[369,"Université_Abdelhamid_Ibn_Badis_de_Mostaganem","Protection, Valorisation des Ressources Marines Littorales et Systématique Moléculaire","Université Abdelhamid Ibn Badis de Mostaganem"]
[370,"Université_Abderrahmane_Mira_de_Béjaia","Biomathématique, Biophysique, Biochimie Et Scientométrie","Université Abderrahmane Mira de Béjaia"]
[371,"Université_Abderrahmane_Mira_de_Béjaia","Ecologie Et Environnement","Université Abderrahmane Mira de Béjaia"]
[372,"Université_Abderrahmane_Mira_de_Béjaia","Economie Et Développement","Université Abderrahmane Mira de Béjaia"]
[373,"Université_Abderrahmane_Mira_de_Béjaia","Génie De L'Environnement","Université Abderrahmane Mira de Béjaia"]
[374,"Université_Abderrahmane_Mira_de_Béjaia","Génie Électrique","Université Abderrahmane Mira de Béjaia"]
[375,"Université_Abderrahmane_Mira_de_Béjaia","Matériaux Organiques","Université Abderrahmane Mira de Béjaia"]
[376,"Université_Abderrahmane_Mira_de_Béjaia","Microbiologie Appliquée","Université Abderrahmane Mira de Béjaia"]
[377,"Université_Abderrahmane_Mira_de_Béjaia","Technologie Industrielle Et De L'Information","Université Abderrahmane Mira de Béjaia"]
[378,"Université_Abderrahmane_Mira_de_Béjaia","Technologies Des Matériaux Et De Génie Des Procédés","Université Abderrahmane Mira de Béjaia"]
[379,"Université_Abderrahmane_Mira_de_Béjaia","Mathématiques Appliquées","Université Abderrahmane Mira de Béjaia"]
[380,"Université_Abderrahmane_Mira_de_Béjaia","Physique Théorique","Université Abderrahmane Mira de Béjaia"]
[381,"Université_Abderrahmane_Mira_de_Béjaia","Hydraulique Appliquée Et Environnement","Université Abderrahmane Mira de Béjaia"]
[382,"Université_Abderrahmane_Mira_de_Béjaia","Biochimie Appliquée","Université Abderrahmane Mira de Béjaia"]
[383,"Université_Abderrahmane_Mira_de_Béjaia","Formation En Langues Appliquées Et Ingénierie Des Langues En Milieu Multilingue","Université Abderrahmane Mira de Béjaia"]
[384,"Université_Abderrahmane_Mira_de_Béjaia","Ecosystèmes Marins Et Aquacoles (Lab. Associé avec MPRH)","Université Abderrahmane Mira de Béjaia"]
[385,"Université_Abderrahmane_Mira_de_Béjaia","Biotechnologies Végétales Et Ethnobotanique","Université Abderrahmane Mira de Béjaia"]
[386,"Université_Abderrahmane_Mira_de_Béjaia","Ecologie Microbienne","Université Abderrahmane Mira de Béjaia"]
[387,"Université_Abderrahmane_Mira_de_Béjaia","Maitrise Des Energies Renouvelables","Université Abderrahmane Mira de Béjaia"]
[388,"Université_Abderrahmane_Mira_de_Béjaia","Zoologie Appliquée Et D’Ecophysiologie Animale","Université Abderrahmane Mira de Béjaia"]
[389,"Université_Abderrahmane_Mira_de_Béjaia","Electrochimie, Corrosion Et De Valorisation Énergétique","Université Abderrahmane Mira de Béjaia"]
[390,"Université_Abderrahmane_Mira_de_Béjaia","Génie Biologique Des Cancers","Université Abderrahmane Mira de Béjaia"]
[391,"Université_Abderrahmane_Mira_de_Béjaia","Génie De La Construction Et Architecture","Université Abderrahmane Mira de Béjaia"]
[392,"Université_Abderrahmane_Mira_de_Béjaia","Informatique Médicale","Université Abderrahmane Mira de Béjaia"]
[393,"Université_Abderrahmane_Mira_de_Béjaia","Interdisciplinaire Santé Et Population","Université Abderrahmane Mira de Béjaia"]
[394,"Université_Abderrahmane_Mira_de_Béjaia","Matériaux Polymères Avancés","Université Abderrahmane Mira de Béjaia"]
[395,"Université_Abderrahmane_Mira_de_Béjaia","Mécanique, Matériaux Et Énergétique","Université Abderrahmane Mira de Béjaia"]
[396,"Université_Abderrahmane_Mira_de_Béjaia","Physico-Chimie Des Matériaux Et Catalyse","Université Abderrahmane Mira de Béjaia"]
[397,"Université_Abderrahmane_Mira_de_Béjaia","Procédés Membranaires Et Des Techniques De Séparation Et De Récupération","Université Abderrahmane Mira de Béjaia"]
[398,"Université_Abderrahmane_Mira_de_Béjaia","Unité De Recherche: Modélisation Et Optimisation Des Systèmes (Remplace Le Lr 2000 \"Modélisation Et Optimisation Des Systèmes\")","Université Abderrahmane Mira de Béjaia"]
[399,"Université_Abderrahmane_Mira_de_Béjaia","Effectivité de la Norme Juridique","Université Abderrahmane Mira de Béjaia"]
[400,"Université_Abderrahmane_Mira_de_Béjaia","Les Langues étrangéres de Spécialité en Milieux Socioprofessionnels:préparation à la professionnalisation","Université Abderrahmane Mira de Béjaia"]
[401,"Université_Abderrahmane_Mira_de_Béjaia","management et techniques quantitatives","Université Abderrahmane Mira de Béjaia"]
[402,"Université_Abou_Elkacem_Saad_Allah_Alger_2","Changement Social","Université Abou Elkacem Saad Allah Alger 2"]
[403,"Université_Abou_Elkacem_Saad_Allah_Alger_2","Education-Formation-Orientation-Travail","Université Abou Elkacem Saad Allah Alger 2"]
[404,"Université_Abou_Elkacem_Saad_Allah_Alger_2","Traduction Et Terminologie","Université Abou Elkacem Saad Allah Alger 2"]
[405,"Université_Abou_Elkacem_Saad_Allah_Alger_2","Etudes Et Recherche En Acoustique","Université Abou Elkacem Saad Allah Alger 2"]
[406,"Université_Abou_Elkacem_Saad_Allah_Alger_2","Linguistique Et Didactique Des Langues","Université Abou Elkacem Saad Allah Alger 2"]
[407,"Université_Abou_Elkacem_Saad_Allah_Alger_2","Manuscrits","Université Abou Elkacem Saad Allah Alger 2"]
[408,"Université_Abou_Elkacem_Saad_Allah_Alger_2","Prévention Et Ergonomie","Université Abou Elkacem Saad Allah Alger 2"]
[409,"Université_Abou_Elkacem_Saad_Allah_Alger_2","Atlas De La Culture Populaire Algérienne","Université Abou Elkacem Saad Allah Alger 2"]
[410,"Université_Abou_Elkacem_Saad_Allah_Alger_2","Discours Soufi Dans La Littérature Et La Langue","Université Abou Elkacem Saad Allah Alger 2"]
[411,"Université_Abou_Elkacem_Saad_Allah_Alger_2","Evolution De La Civilisation Du Maghreb Central Algérie Jusqu’À La Fin De La Période Otomane","Université Abou Elkacem Saad Allah Alger 2"]
[412,"Université_Abou_Elkacem_Saad_Allah_Alger_2","Psychologie Et Sciences De L’Éducation","Université Abou Elkacem Saad Allah Alger 2"]
[413,"Université_Abou_Elkacem_Saad_Allah_Alger_2","Vérification Des Manuscrits Et Étude Du Patrimoine Littéraire Et Linguistique","Université Abou Elkacem Saad Allah Alger 2"]
[414,"Université_Abou_Elkacem_Saad_Allah_Alger_2","Anthropologie Psychanalitique Et De Psychopatologie","Université Abou Elkacem Saad Allah Alger 2"]
[415,"Université_Abou_Elkacem_Saad_Allah_Alger_2","Unité Et Etudes Maghrébines À Travers L'Histoire","Université Abou Elkacem Saad Allah Alger 2"]
[416,"Université_Abou_Elkacem_Saad_Allah_Alger_2","Etudes Philosophiques Et Axiologiques","Université Abou Elkacem Saad Allah Alger 2"]
[417,"Université_Abou_Elkacem_Saad_Allah_Alger_2","Passé Colonial Français Au Miroir Du Temps Présent: Algérie, Moyen Orient, Méditerranée","Université Abou Elkacem Saad Allah Alger 2"]
[418,"Université_Abou_Elkacem_Saad_Allah_Alger_2","Psychométrie & Counseling","Université Abou Elkacem Saad Allah Alger 2"]
[419,"Université_Abou_Elkacem_Saad_Allah_Alger_2","Problématique De La Recherche Scientifique(L'Élaboration De La Société Arabe Contemporaine ,L'Lagérie Comme Modèle )","Université Abou Elkacem Saad Allah Alger 2"]
[420,"Université_Abou_Elkacem_Saad_Allah_Alger_2","Archéologie Patrimoine Et Archéométrie","Université Abou Elkacem Saad Allah Alger 2"]
[421,"Université_Abou_Elkacem_Saad_Allah_Alger_2","Esthétique Des Arts Et Philosophie Contemporaine","Université Abou Elkacem Saad Allah Alger 2"]
[422,"Université_Abou_Elkacem_Saad_Allah_Alger_2","Etudes Africaines","Université Abou Elkacem Saad Allah Alger 2"]
[423,"Université_Abou_Elkacem_Saad_Allah_Alger_2","Famille, Développement , Prévention De La Délinquance Et Criminologie","Université Abou Elkacem Saad Allah Alger 2"]
[424,"Université_Abou_Elkacem_Saad_Allah_Alger_2","Problèmes De La Civilisation Et Histoire En Algérie","Université Abou Elkacem Saad Allah Alger 2"]
[425,"Université_Abou_Elkacem_Saad_Allah_Alger_2","Psychologie Clinique Et Metrique","Université Abou Elkacem Saad Allah Alger 2"]
[426,"Université_Abou_Elkacem_Saad_Allah_Alger_2","Réforme De L’Enseignement Supérieur Algérien: Enseignement, Savoir Et Société","Université Abou Elkacem Saad Allah Alger 2"]
[427,"Université_Abou_Elkacem_Saad_Allah_Alger_2","Religion Et Société","Université Abou Elkacem Saad Allah Alger 2"]
[428,"Université_Abou_Elkacem_Saad_Allah_Alger_2","Socio Anthropologie Du Développement Des Territoires","Université Abou Elkacem Saad Allah Alger 2"]
[429,"Université_Abou_Elkacem_Saad_Allah_Alger_2","Sociologie Des Organisations Et De Management","Université Abou Elkacem Saad Allah Alger 2"]
[430,"Université_Abou_Elkacem_Saad_Allah_Alger_2","Unité De Recherche: Neurosciences Cognitives - Orthophonie - Phoniatrie (Remplace Le Lr 2000 \" Sciences Du Langage-Neurosciences Cognitives-Communication Slancom\")","Université Abou Elkacem Saad Allah Alger 2"]
[431,"Université_Abou_Elkacem_Saad_Allah_Alger_2","ترجمة الوتائق التاريخية","Université Abou Elkacem Saad Allah Alger 2"]
[432,"Université_Abou_Elkacem_Saad_Allah_Alger_2","Interdisciplinaire de Recherche : Analyse du Discours, Didactique des langues et interculturalité","Université Abou Elkacem Saad Allah Alger 2"]
[433,"Université_Abou_Elkacem_Saad_Allah_Alger_2","linguistique appliquée et enseignement des langues","Université Abou Elkacem Saad Allah Alger 2"]
[434,"Université_Abou_Elkacem_Saad_Allah_Alger_2","Psychologie de la santé, prévention et qualité de vie.  ","Université Abou Elkacem Saad Allah Alger 2"]
[435,"Université_Abou_Elkacem_Saad_Allah_Alger_2","psychologie sociale et les fléaux sociaux","Université Abou Elkacem Saad Allah Alger 2"]
[436,"Université_Aboubeker_Belkaid_de_Tlemcen","Analyses Statistiques En Sciences Humaines Et Réalisation D’Un Dictionnaire Unifiant Basé Sur Des Critères Scientifiques","Université Aboubeker Belkaid de Tlemcen"]
[437,"Université_Aboubeker_Belkaid_de_Tlemcen","Automatique","Université Aboubeker Belkaid de Tlemcen"]
[438,"Université_Aboubeker_Belkaid_de_Tlemcen","Catalyse Et Synthèse En Chimie Organique","Université Aboubeker Belkaid de Tlemcen"]
[439,"Université_Aboubeker_Belkaid_de_Tlemcen","Chimie Organique, Substances Naturelles Et Analyses","Université Aboubeker Belkaid de Tlemcen"]
[440,"Université_Aboubeker_Belkaid_de_Tlemcen","Droit Privé Fondamental","Université Aboubeker Belkaid de Tlemcen"]
[441,"Université_Aboubeker_Belkaid_de_Tlemcen","Eau Et Ouvrages Dans Leur Environnement","Université Aboubeker Belkaid de Tlemcen"]
[442,"Université_Aboubeker_Belkaid_de_Tlemcen","Ecologie Et Gestion Des Écosystèmes Naturels","Université Aboubeker Belkaid de Tlemcen"]
[443,"Université_Aboubeker_Belkaid_de_Tlemcen","Etudes Civilisationnelles Et Intellectuelles","Université Aboubeker Belkaid de Tlemcen"]
[444,"Université_Aboubeker_Belkaid_de_Tlemcen","Etudes Critiques Littéraires Et Leur Information Dans Le Maghreb Arabe Depuis Leur Institution Jusqu'À La Fin Du 20 Éme Siècle","Université Aboubeker Belkaid de Tlemcen"]
[445,"Université_Aboubeker_Belkaid_de_Tlemcen","Evaluation De L’Enseignement De La Langue Arabe Au Fondamental Et Au Lycée Sur La Base De L’Étude Du Cadre D’Enseignement Et Des Moyens D’Apprentissage","Université Aboubeker Belkaid de Tlemcen"]
[446,"Université_Aboubeker_Belkaid_de_Tlemcen","Génie Biomédical","Université Aboubeker Belkaid de Tlemcen"]
[447,"Université_Aboubeker_Belkaid_de_Tlemcen","Macromoléculaires","Université Aboubeker Belkaid de Tlemcen"]
[448,"Université_Aboubeker_Belkaid_de_Tlemcen","Physique Théorique","Université Aboubeker Belkaid de Tlemcen"]
[449,"Université_Aboubeker_Belkaid_de_Tlemcen","Produits Naturels « Laprona »","Université Aboubeker Belkaid de Tlemcen"]
[450,"Université_Aboubeker_Belkaid_de_Tlemcen","Systèmes Dynamiques Et Applications","Université Aboubeker Belkaid de Tlemcen"]
[451,"Université_Aboubeker_Belkaid_de_Tlemcen","Télécommunications","Université Aboubeker Belkaid de Tlemcen"]
[452,"Université_Aboubeker_Belkaid_de_Tlemcen","Tradition Et Formes D'Expression Populaire En Algérie","Université Aboubeker Belkaid de Tlemcen"]
[453,"Université_Aboubeker_Belkaid_de_Tlemcen","Traitement Automatique De La Langue Arabe","Université Aboubeker Belkaid de Tlemcen"]
[454,"Université_Aboubeker_Belkaid_de_Tlemcen","Valorisation Des Actions De L'Homme Pour La Protection De L'Environnement Et Application En Santé Publique","Université Aboubeker Belkaid de Tlemcen"]
[455,"Université_Aboubeker_Belkaid_de_Tlemcen","Anthropologie Des Religions Et Leur Comparaison : Étude Socio Anthropologique","Université Aboubeker Belkaid de Tlemcen"]
[456,"Université_Aboubeker_Belkaid_de_Tlemcen","Antibiotiques, Antifongiques, Physico-Chimie, Synthèse Et Activité Biologique","Université Aboubeker Belkaid de Tlemcen"]
[457,"Université_Aboubeker_Belkaid_de_Tlemcen","Arabisation Terminologique En Sciences Humaines Et Sociales","Université Aboubeker Belkaid de Tlemcen"]
[458,"Université_Aboubeker_Belkaid_de_Tlemcen","Evaluation De La Politique De Développement En Algérie","Université Aboubeker Belkaid de Tlemcen"]
[459,"Université_Aboubeker_Belkaid_de_Tlemcen","Management Des Entreprises Et Du Capital Social","Université Aboubeker Belkaid de Tlemcen"]
[460,"Université_Aboubeker_Belkaid_de_Tlemcen","Promotion Des Ressources Hydriques, Minières Pédologiques: Législation De L'Environnement Et Des Choix Technologiques","Université Aboubeker Belkaid de Tlemcen"]
[461,"Université_Aboubeker_Belkaid_de_Tlemcen","Références Philosophiques Et Artistiques De La Pensée Littéraire Et Critique En Algérie – Des Conquêtes Au Colonialisme Français","Université Aboubeker Belkaid de Tlemcen"]
[462,"Université_Aboubeker_Belkaid_de_Tlemcen","Risque Cardio-Vasculaire (Endocard)","Université Aboubeker Belkaid de Tlemcen"]
[463,"Université_Aboubeker_Belkaid_de_Tlemcen","Spectrochimie Et Pharmacologie Structurale","Université Aboubeker Belkaid de Tlemcen"]
[464,"Université_Aboubeker_Belkaid_de_Tlemcen","Cancerlab","Université Aboubeker Belkaid de Tlemcen"]
[465,"Université_Aboubeker_Belkaid_de_Tlemcen","Gestion Conservatoire De L'Eau Et Du Sol Et Des Forets Et Développement Durable Des Zones Montagneuses De La Région De Tlemcen","Université Aboubeker Belkaid de Tlemcen"]
[466,"Université_Aboubeker_Belkaid_de_Tlemcen","Unité De Recherche: Matériaux Et Énergies Renouvelables (En Remplacement Du Lr Matériaux Et Energies Renouvelables Agréé En 2000)","Université Aboubeker Belkaid de Tlemcen"]
[467,"Université_Aboubeker_Belkaid_de_Tlemcen","Toximed","Université Aboubeker Belkaid de Tlemcen"]
[468,"Université_Aboubeker_Belkaid_de_Tlemcen","Chimie Inorganique Et Environnement","Université Aboubeker Belkaid de Tlemcen"]
[469,"Université_Aboubeker_Belkaid_de_Tlemcen","Droit De L'Homme Et Liberté Fondamentale","Université Aboubeker Belkaid de Tlemcen"]
[470,"Université_Aboubeker_Belkaid_de_Tlemcen","Systèmes Et Technologies De L`Information Et De La Communication","Université Aboubeker Belkaid de Tlemcen"]
[471,"Université_Aboubeker_Belkaid_de_Tlemcen","Application Des Électrolytes Et De Poly Électrolytes Organiques","Université Aboubeker Belkaid de Tlemcen"]
[472,"Université_Aboubeker_Belkaid_de_Tlemcen","Microbiologie Appliqué À L'Agroalimentaire, Au Biomédical Et À L'Nvironnement (Lamaabe)","Université Aboubeker Belkaid de Tlemcen"]
[473,"Université_Aboubeker_Belkaid_de_Tlemcen","Chirurgie Expérimentale","Université Aboubeker Belkaid de Tlemcen"]
[474,"Université_Aboubeker_Belkaid_de_Tlemcen","Evaluation Et Management De Risques","Université Aboubeker Belkaid de Tlemcen"]
[475,"Université_Aboubeker_Belkaid_de_Tlemcen","Technologies De Séparation Et De Purification","Université Aboubeker Belkaid de Tlemcen"]
[476,"Université_Aboubeker_Belkaid_de_Tlemcen","Biologie Moléculaire Appliquée Et D’Immunologie","Université Aboubeker Belkaid de Tlemcen"]
[477,"Université_Aboubeker_Belkaid_de_Tlemcen","Dialogue Des Religions Et Des Civilisations Dans Le Bassin Méditerranéen","Université Aboubeker Belkaid de Tlemcen"]
[478,"Université_Aboubeker_Belkaid_de_Tlemcen","Dynamique Des Langues Et Discours En Méditerranée","Université Aboubeker Belkaid de Tlemcen"]
[479,"Université_Aboubeker_Belkaid_de_Tlemcen","Entreprise Industrielle Et Société En Algérie","Université Aboubeker Belkaid de Tlemcen"]
[480,"Université_Aboubeker_Belkaid_de_Tlemcen","Ingénierie Des Systèmes Mécaniques Et Matériaux","Université Aboubeker Belkaid de Tlemcen"]
[481,"Université_Aboubeker_Belkaid_de_Tlemcen","Monnaie Et Institutions Financières Dans Le Maghreb Arabe","Université Aboubeker Belkaid de Tlemcen"]
[482,"Université_Aboubeker_Belkaid_de_Tlemcen","Patrimoine Archeologique Et Sa Valorisation","Université Aboubeker Belkaid de Tlemcen"]
[483,"Université_Aboubeker_Belkaid_de_Tlemcen","Physiologie, Physiopathologie Et Biochimie De La Nutrition","Université Aboubeker Belkaid de Tlemcen"]
[484,"Université_Aboubeker_Belkaid_de_Tlemcen","Productique De Tlemcen","Université Aboubeker Belkaid de Tlemcen"]
[485,"Université_Aboubeker_Belkaid_de_Tlemcen","Recueil Et Authentification De La Poésie Populaire Algérienne De L'Époque Othomane Au 20Éme Siècle","Université Aboubeker Belkaid de Tlemcen"]
[486,"Université_Aboubeker_Belkaid_de_Tlemcen","Statistiques Et Modélisations Aléatoires","Université Aboubeker Belkaid de Tlemcen"]
[487,"Université_Aboubeker_Belkaid_de_Tlemcen","Substances Naturelles Et Bioactives Lasnabio","Université Aboubeker Belkaid de Tlemcen"]
[488,"Université_Aboubeker_Belkaid_de_Tlemcen","Thermodynamique Appliquée Et Modélisation Moléculaire","Université Aboubeker Belkaid de Tlemcen"]
[489,"Université_Aboubeker_Belkaid_de_Tlemcen","Chimie Analytique Et D’Electrochimie","Université Aboubeker Belkaid de Tlemcen"]
[490,"Université_Aboubeker_Belkaid_de_Tlemcen","Droit Comparé","Université Aboubeker Belkaid de Tlemcen"]
[491,"Université_Aboubeker_Belkaid_de_Tlemcen","Droit Maritime Et Transport","Université Aboubeker Belkaid de Tlemcen"]
[492,"Université_Aboubeker_Belkaid_de_Tlemcen","Economie Informelle, Institutions Et Developpement","Université Aboubeker Belkaid de Tlemcen"]
[493,"Université_Aboubeker_Belkaid_de_Tlemcen","Energétique Et Thermique Appliquée","Université Aboubeker Belkaid de Tlemcen"]
[494,"Université_Aboubeker_Belkaid_de_Tlemcen","English For Specific Purposes Teaching Laboratory","Université Aboubeker Belkaid de Tlemcen"]
[495,"Université_Aboubeker_Belkaid_de_Tlemcen","Etudes De Charia","Université Aboubeker Belkaid de Tlemcen"]
[496,"Université_Aboubeker_Belkaid_de_Tlemcen","Etudes Littéraires Et Linguistiques Andalouses","Université Aboubeker Belkaid de Tlemcen"]
[497,"Université_Aboubeker_Belkaid_de_Tlemcen","Groupe De Recherche En Economie Des Finances Publiques","Université Aboubeker Belkaid de Tlemcen"]
[498,"Université_Aboubeker_Belkaid_de_Tlemcen","Management Des Hommes Et Des Organisations","Université Aboubeker Belkaid de Tlemcen"]
[499,"Université_Aboubeker_Belkaid_de_Tlemcen","Modernisation De La Grammaire Arabe","Université Aboubeker Belkaid de Tlemcen"]
[500,"Université_Aboubeker_Belkaid_de_Tlemcen","Population Et Développement Durable En Algérie","Université Aboubeker Belkaid de Tlemcen"]
[501,"Université_Aboubeker_Belkaid_de_Tlemcen","Valorisation Des Ressources En Eau","Université Aboubeker Belkaid de Tlemcen"]
[502,"Université_Aboubeker_Belkaid_de_Tlemcen","Analyse Non Linèaire Et Mathimatiques Appliquèes","Université Aboubeker Belkaid de Tlemcen"]
[503,"Université_Aboubeker_Belkaid_de_Tlemcen","Gouvernance Publique Et Économie Sociale","Université Aboubeker Belkaid de Tlemcen"]
[504,"Université_Aboubeker_Belkaid_de_Tlemcen","Mécanique Computationnelle","Université Aboubeker Belkaid de Tlemcen"]
[505,"Université_Aboubeker_Belkaid_de_Tlemcen","Méditerranéen Des Etudes Juridiques","Université Aboubeker Belkaid de Tlemcen"]
[506,"Université_Aboubeker_Belkaid_de_Tlemcen","Phénoménologie Et Ses Applications","Université Aboubeker Belkaid de Tlemcen"]
[507,"Université_Aboubeker_Belkaid_de_Tlemcen","Diversité Des Langues, Expressions Littéraires Et Interactions Culturelles","Université Aboubeker Belkaid de Tlemcen"]
[508,"Université_Aboubeker_Belkaid_de_Tlemcen","Foeign Language Policy In Algeria And Teacher Professionalism","Université Aboubeker Belkaid de Tlemcen"]
[509,"Université_Aboubeker_Belkaid_de_Tlemcen","Recherche En Informatique","Université Aboubeker Belkaid de Tlemcen"]
[510,"Université_Aboubeker_Belkaid_de_Tlemcen","Anthropologie Congnitive","Université Aboubeker Belkaid de Tlemcen"]
[511,"Université_Aboubeker_Belkaid_de_Tlemcen","Arts et études culturelles ","Université Aboubeker Belkaid de Tlemcen"]
[512,"Université_Ahmed_Ben_Bella_Es_Senia_Oran_1","Biologie Buccale","Université Ahmed Ben Bella Es Senia Oran 1"]
[513,"Université_Ahmed_Ben_Bella_Es_Senia_Oran_1","Biologie De Micro-Organismes Et Biotechnologie","Université Ahmed Ben Bella Es Senia Oran 1"]
[514,"Université_Ahmed_Ben_Bella_Es_Senia_Oran_1","Chimie Des Matériaux","Université Ahmed Ben Bella Es Senia Oran 1"]
[515,"Université_Ahmed_Ben_Bella_Es_Senia_Oran_1","Chimie Des Polymères","Université Ahmed Ben Bella Es Senia Oran 1"]
[516,"Université_Ahmed_Ben_Bella_Es_Senia_Oran_1","Chimie Physique Macromoléculaire","Université Ahmed Ben Bella Es Senia Oran 1"]
[517,"Université_Ahmed_Ben_Bella_Es_Senia_Oran_1","Didactique de la Traduction et Multi-Linguisme","Université Ahmed Ben Bella Es Senia Oran 1"]
[518,"Université_Ahmed_Ben_Bella_Es_Senia_Oran_1","Etude Des Matériaux, Optoélectronique Et Polymères","Université Ahmed Ben Bella Es Senia Oran 1"]
[519,"Université_Ahmed_Ben_Bella_Es_Senia_Oran_1","Histoire De L’Algérie","Université Ahmed Ben Bella Es Senia Oran 1"]
[520,"Université_Ahmed_Ben_Bella_Es_Senia_Oran_1","Manuscrits De La Civilisation Islamique En Afrique Du Nord","Université Ahmed Ben Bella Es Senia Oran 1"]
[521,"Université_Ahmed_Ben_Bella_Es_Senia_Oran_1","Nutrition Clinique Et Métabolique","Université Ahmed Ben Bella Es Senia Oran 1"]
[522,"Université_Ahmed_Ben_Bella_Es_Senia_Oran_1","Pédagogie Et Développement En Didactique Des Sciences Médicales","Université Ahmed Ben Bella Es Senia Oran 1"]
[523,"Université_Ahmed_Ben_Bella_Es_Senia_Oran_1","Physiologie De La Nutrition Et Sécurité Alimentaire","Université Ahmed Ben Bella Es Senia Oran 1"]
[524,"Université_Ahmed_Ben_Bella_Es_Senia_Oran_1","Physique Des Couches Minces Et Matériaux Pour L'Électronique","Université Ahmed Ben Bella Es Senia Oran 1"]
[525,"Université_Ahmed_Ben_Bella_Es_Senia_Oran_1","Physique Théorique","Université Ahmed Ben Bella Es Senia Oran 1"]
[526,"Université_Ahmed_Ben_Bella_Es_Senia_Oran_1","Réseau De Surveillance Environnementale","Université Ahmed Ben Bella Es Senia Oran 1"]
[527,"Université_Ahmed_Ben_Bella_Es_Senia_Oran_1","Sources Et Biographies","Université Ahmed Ben Bella Es Senia Oran 1"]
[528,"Université_Ahmed_Ben_Bella_Es_Senia_Oran_1","Surveillance Du Cancer","Université Ahmed Ben Bella Es Senia Oran 1"]
[529,"Université_Ahmed_Ben_Bella_Es_Senia_Oran_1","Synthèse Organique Appliquée","Université Ahmed Ben Bella Es Senia Oran 1"]
[530,"Université_Ahmed_Ben_Bella_Es_Senia_Oran_1","Technologie Et Biomatériaux Dentaires","Université Ahmed Ben Bella Es Senia Oran 1"]
[531,"Université_Ahmed_Ben_Bella_Es_Senia_Oran_1","Biologie Du Développement Et De Différenciation","Université Ahmed Ben Bella Es Senia Oran 1"]
[532,"Université_Ahmed_Ben_Bella_Es_Senia_Oran_1","Environnement, Épidémiologie Et Santé De L'Enfant","Université Ahmed Ben Bella Es Senia Oran 1"]
[533,"Université_Ahmed_Ben_Bella_Es_Senia_Oran_1","Expérimentation D'Une Nouvelle Approche D'Évaluation Dans Les Services De La Santé","Université Ahmed Ben Bella Es Senia Oran 1"]
[534,"Université_Ahmed_Ben_Bella_Es_Senia_Oran_1","Microbiologie Appliquée","Université Ahmed Ben Bella Es Senia Oran 1"]
[535,"Université_Ahmed_Ben_Bella_Es_Senia_Oran_1","Sciences De La Matière Condensée","Université Ahmed Ben Bella Es Senia Oran 1"]
[536,"Université_Ahmed_Ben_Bella_Es_Senia_Oran_1","Discours Littéraire En Algérie","Université Ahmed Ben Bella Es Senia Oran 1"]
[537,"Université_Ahmed_Ben_Bella_Es_Senia_Oran_1","Langue Arabe Et La Communication","Université Ahmed Ben Bella Es Senia Oran 1"]
[538,"Université_Ahmed_Ben_Bella_Es_Senia_Oran_1","Sémiotique Et Analyse Du Discours","Université Ahmed Ben Bella Es Senia Oran 1"]
[539,"Université_Ahmed_Ben_Bella_Es_Senia_Oran_1","Systèmes D'Information En Santé","Université Ahmed Ben Bella Es Senia Oran 1"]
[540,"Université_Ahmed_Ben_Bella_Es_Senia_Oran_1","Santé Et Environnement","Université Ahmed Ben Bella Es Senia Oran 1"]
[541,"Université_Ahmed_Ben_Bella_Es_Senia_Oran_1","Biotechnologies Des Rhizobia Et Amélioration Des Plantes","Université Ahmed Ben Bella Es Senia Oran 1"]
[542,"Université_Ahmed_Ben_Bella_Es_Senia_Oran_1","Informatique D'Oran","Université Ahmed Ben Bella Es Senia Oran 1"]
[543,"Université_Ahmed_Ben_Bella_Es_Senia_Oran_1","Informatique Et Technologies De L'Information","Université Ahmed Ben Bella Es Senia Oran 1"]
[544,"Université_Ahmed_Ben_Bella_Es_Senia_Oran_1","Archivage Du Théâtre Algérien Et Elaboration D'Un Répertoire Et Dictionnaire Des Hommes De Théâtre En Algérie","Université Ahmed Ben Bella Es Senia Oran 1"]
[545,"Université_Ahmed_Ben_Bella_Es_Senia_Oran_1","Biotoxicologie Expérimentale De Bio Dépollution Et De Pyttoremédiation","Université Ahmed Ben Bella Es Senia Oran 1"]
[546,"Université_Ahmed_Ben_Bella_Es_Senia_Oran_1","Accidentologie Pédiatrique","Université Ahmed Ben Bella Es Senia Oran 1"]
[547,"Université_Ahmed_Ben_Bella_Es_Senia_Oran_1","Aquaculture Et Bioremédiation","Université Ahmed Ben Bella Es Senia Oran 1"]
[548,"Université_Ahmed_Ben_Bella_Es_Senia_Oran_1","Chimie Fine","Université Ahmed Ben Bella Es Senia Oran 1"]
[549,"Université_Ahmed_Ben_Bella_Es_Senia_Oran_1","Géométrie Et Analyse","Université Ahmed Ben Bella Es Senia Oran 1"]
[550,"Université_Ahmed_Ben_Bella_Es_Senia_Oran_1","Informatique Industrielle Et Réseaux","Université Ahmed Ben Bella Es Senia Oran 1"]
[551,"Université_Ahmed_Ben_Bella_Es_Senia_Oran_1","Analyse Et Conception De Modèles Médiatiques En Histoire, Économie, Sociologie, Politique","Université Ahmed Ben Bella Es Senia Oran 1"]
[552,"Université_Ahmed_Ben_Bella_Es_Senia_Oran_1","Analyse Mathematique Et Applications","Université Ahmed Ben Bella Es Senia Oran 1"]
[553,"Université_Ahmed_Ben_Bella_Es_Senia_Oran_1","Communication De Masse Et La Sémiologie Des Systèmes Visuels","Université Ahmed Ben Bella Es Senia Oran 1"]
[554,"Université_Ahmed_Ben_Bella_Es_Senia_Oran_1","Enseignement Et Recherche En Maladies Emergentes Et Ré Emergentes","Université Ahmed Ben Bella Es Senia Oran 1"]
[555,"Université_Ahmed_Ben_Bella_Es_Senia_Oran_1","Image De La Révolution Algérienne Dans La Littérature Arabe Et Universelle","Université Ahmed Ben Bella Es Senia Oran 1"]
[556,"Université_Ahmed_Ben_Bella_Es_Senia_Oran_1","Linguistique Et L’Analyse Du Discours","Université Ahmed Ben Bella Es Senia Oran 1"]
[557,"Université_Ahmed_Ben_Bella_Es_Senia_Oran_1","Mathématiques Et Ses Applications","Université Ahmed Ben Bella Es Senia Oran 1"]
[558,"Université_Ahmed_Ben_Bella_Es_Senia_Oran_1","Répertoire Et Archivage Des Films Révolutionnaires Dans Le Cinéma Algérien","Université Ahmed Ben Bella Es Senia Oran 1"]
[559,"Université_Ahmed_Ben_Bella_Es_Senia_Oran_1","Vih / Sida Et Maladies Associées","Université Ahmed Ben Bella Es Senia Oran 1"]
[560,"Université_Ahmed_Ben_Bella_Es_Senia_Oran_1","Architectures Parallèles,Embarquèes Et Calcul Intensif","Université Ahmed Ben Bella Es Senia Oran 1"]
[561,"Université_Ahmed_Ben_Bella_Es_Senia_Oran_1","Développement Pharmaceutique","Université Ahmed Ben Bella Es Senia Oran 1"]
[562,"Université_Ahmed_Ben_Bella_Es_Senia_Oran_1","Etudes Maghrébines, Les Élites Et La Construction De L’État National","Université Ahmed Ben Bella Es Senia Oran 1"]
[563,"Université_Ahmed_Ben_Bella_Es_Senia_Oran_1","Génétique Microbienne","Université Ahmed Ben Bella Es Senia Oran 1"]
[564,"Université_Ahmed_Ben_Bella_Es_Senia_Oran_1","La Sémantique Dans Les Niveaux Linguistique Dans Le Patrimoine Littéraire Algérien","Université Ahmed Ben Bella Es Senia Oran 1"]
[565,"Université_Ahmed_Ben_Bella_Es_Senia_Oran_1","Les Systèmes D'Information Et Des Archives En Algérie. Mutations Technologiques, Pratiques Professionnelles Et Normes Internationales","Université Ahmed Ben Bella Es Senia Oran 1"]
[566,"Université_Ahmed_Ben_Bella_Es_Senia_Oran_1","Odontologie Conservatrice Et Endodontie","Université Ahmed Ben Bella Es Senia Oran 1"]
[567,"Université_Ahmed_Ben_Bella_Es_Senia_Oran_1","Prise En Charge De La Douleur Chronique À L’Ouest Algérien","Université Ahmed Ben Bella Es Senia Oran 1"]
[568,"Université_Ahmed_Ben_Bella_Es_Senia_Oran_1","Surveillance Des Accidents Vasculaires Cérébraux","Université Ahmed Ben Bella Es Senia Oran 1"]
[569,"Université_Ahmed_Ben_Bella_Es_Senia_Oran_1","Dialectes et Traitement de la Parole","Université Ahmed Ben Bella Es Senia Oran 1"]
[570,"Université_Ahmed_Ben_Bella_Es_Senia_Oran_1","Études Des Sciences De L'Environnement Et Des Matériaux","Université Ahmed Ben Bella Es Senia Oran 1"]
[571,"Université_Ahmed_Ben_Bella_Es_Senia_Oran_1","Mathématiques Fondamentales Et Appliquées D'Oran","Université Ahmed Ben Bella Es Senia Oran 1"]
[572,"Université_Ahmed_Ben_Bella_Es_Senia_Oran_1","Surveillance Des Infections Liées Aux Soins À Oran","Université Ahmed Ben Bella Es Senia Oran 1"]
[573,"Université_Ahmed_Ben_Bella_Es_Senia_Oran_1","Etudes Coraniques et Finalités","Université Ahmed Ben Bella Es Senia Oran 1"]
[574,"Université_Ahmed_Ben_Bella_Es_Senia_Oran_1","Etudes Sur les Domaines d'Al Ijaz : Patrimoine Classique et Contemporain ","Université Ahmed Ben Bella Es Senia Oran 1"]
[575,"Université_Ahmed_Ben_Bella_Es_Senia_Oran_1","Génétique Médicale Appliquée à l'Ophtalmologie ","Université Ahmed Ben Bella Es Senia Oran 1"]
[576,"Université_Ahmed_Ben_Bella_Es_Senia_Oran_1","Littérature Populaire en Algérie -Collecte et Etude-","Université Ahmed Ben Bella Es Senia Oran 1"]
[577,"Université_Ahmed_Ben_Bella_Es_Senia_Oran_1","Techniques Innovantes en Médecine  ","Université Ahmed Ben Bella Es Senia Oran 1"]
[578,"Université_Ahmed_Ben_Bella_Es_Senia_Oran_1","Traduction et typologie des textes  ","Université Ahmed Ben Bella Es Senia Oran 1"]
[579,"Université_Ahmed_Draya_Adrar","Etudes Africaines Des Sciences Humaines Et Des Sciences Sociales","Université Ahmed Draya Adrar"]
[580,"Université_Ahmed_Draya_Adrar","Développement Durable Et Information","Université Ahmed Draya Adrar"]
[581,"Université_Ahmed_Draya_Adrar","Energie, Environnement Et Système D'Information","Université Ahmed Draya Adrar"]
[582,"Université_Ahmed_Draya_Adrar","Droit Et Société","Université Ahmed Draya Adrar"]
[583,"Université_Ahmed_Draya_Adrar","Integration Economique Algero-Africaine","Université Ahmed Draya Adrar"]
[584,"Université_Ahmed_Draya_Adrar","Manuscrits Informateur Algérien En Afrique.(Inventaire Et De Comptage, D'Indexation Et D'Enquête )","Université Ahmed Draya Adrar"]
[585,"Université_Ahmed_Draya_Adrar","EDUCATION  et  DEVELOPEMENT","Université Ahmed Draya Adrar"]
[586,"Université_Akli_Mohand_Oulhadj_de_Bouira","Etude Théorique Et Pratique Approfondie À L'Lmd À L'Université Algérienne En Vue De Créer Des Pôles Universitaires Pour Un Développement Intégré","Université Akli Mohand Oulhadj de Bouira"]
[587,"Université_Akli_Mohand_Oulhadj_de_Bouira","Gestion Et Valorisation Des Ressources Naturelles Et Assurance Qualité","Université Akli Mohand Oulhadj de Bouira"]
[588,"Université_Akli_Mohand_Oulhadj_de_Bouira","Matériaux Et Développement Durable","Université Akli Mohand Oulhadj de Bouira"]
[589,"Université_Akli_Mohand_Oulhadj_de_Bouira","Procédés Pour Matériaux, Énergie, Eau Et Environnement","Université Akli Mohand Oulhadj de Bouira"]
[590,"Université_Akli_Mohand_Oulhadj_de_Bouira","Sciences Modernes Des Activités Physiques Et Sportives","Université Akli Mohand Oulhadj de Bouira"]
[591,"Université_Akli_Mohand_Oulhadj_de_Bouira","Education , Travail Et Orientation","Université Akli Mohand Oulhadj de Bouira"]
[592,"Université_Akli_Mohand_Oulhadj_de_Bouira","Etudes Littéraires, Linguistiques Et Didactiques Amazighes","Université Akli Mohand Oulhadj de Bouira"]
[593,"Université_Akli_Mohand_Oulhadj_de_Bouira","Informatique, Mathématique Et Physique Pour L'Agriculture Et Les Forets","Université Akli Mohand Oulhadj de Bouira"]
[594,"Université_Akli_Mohand_Oulhadj_de_Bouira","Questions De Littérature Maghrébine","Université Akli Mohand Oulhadj de Bouira"]
[595,"Université_Akli_Mohand_Oulhadj_de_Bouira","Etat et le Crime Organisé: Approches des Droits Juridiques Humains aux Démontions Sociaux Economiques, le Blanchiment d'Argent (étude de cas)","Université Akli Mohand Oulhadj de Bouira"]
[596,"Université_Akli_Mohand_Oulhadj_de_Bouira","les PME dans le développement Local,cas wilaya de Bouira","Université Akli Mohand Oulhadj de Bouira"]
[597,"Université_Akli_Mohand_Oulhadj_de_Bouira","les politiques de développement et les études prospectives","Université Akli Mohand Oulhadj de Bouira"]
[598,"Université_Alger_3","Recherches Et Études Politiques","Université Alger 3"]
[599,"Université_Alger_3","Etudes En Relations Internationales","Université Alger 3"]
[600,"Université_Alger_3","Sciences Des Activités Physiques","Université Alger 3"]
[601,"Université_Alger_3","Etude Et Analyse Des Politiques Publiques En Algérie","Université Alger 3"]
[602,"Université_Alger_3","Langues, Communication Et Nouvelles Technologies","Université Alger 3"]
[603,"Université_Alger_3","Management Du Changement Dans L'Entreprise Algérienne","Université Alger 3"]
[604,"Université_Alger_3","Mondialisation Et Politique Économique","Université Alger 3"]
[605,"Université_Alger_3","Sciences Du Sport Et De L'Entrainement De Haut Niveau","Université Alger 3"]
[606,"Université_Alger_3","Sciences Et Pratiques Des Activités Physiques Sportives Et Artistiques","Université Alger 3"]
[607,"Université_Alger_3","Industries Traditionnelles","Université Alger 3"]
[608,"Université_Alger_3","Les Économies Et Le Recherche Pour Le Développement: (Politiques Et Stratégies )","Université Alger 3"]
[609,"Université_Alger_3","Usage Réception Produit Médiatique Et Culturel En Algérie","Université Alger 3"]
[610,"Université_Alger_3","Droits De L'Homme Dans Les Systèmes De Comparaison À La Lumière Des Changements Internationaux Actuels","Université Alger 3"]
[611,"Université_Alger_3","Science de la performance motrice et des interventions pédagogiques","Université Alger 3"]
[612,"Université_Badji_Mokhtar_de_Annaba","Biologie Animale Appliquée","Université Badji Mokhtar de Annaba"]
[613,"Université_Badji_Mokhtar_de_Annaba","Biologie Végétale Et Environnement","Université Badji Mokhtar de Annaba"]
[614,"Université_Badji_Mokhtar_de_Annaba","Biotechnologie Et Développement De La Santé","Université Badji Mokhtar de Annaba"]
[615,"Université_Badji_Mokhtar_de_Annaba","Chimie Organique Appliquée","Université Badji Mokhtar de Annaba"]
[616,"Université_Badji_Mokhtar_de_Annaba","Droit, Urbanisme Et Environnement","Université Badji Mokhtar de Annaba"]
[617,"Université_Badji_Mokhtar_de_Annaba","Etude Des Surfaces Et Interfaces De La Matière","Université Badji Mokhtar de Annaba"]
[618,"Université_Badji_Mokhtar_de_Annaba","Etude Et Recherche Sur Les États Condensés","Université Badji Mokhtar de Annaba"]
[619,"Université_Badji_Mokhtar_de_Annaba","Génie Civil","Université Badji Mokhtar de Annaba"]
[620,"Université_Badji_Mokhtar_de_Annaba","Génie De L'Environnement","Université Badji Mokhtar de Annaba"]
[621,"Université_Badji_Mokhtar_de_Annaba","Informatique","Université Badji Mokhtar de Annaba"]
[622,"Université_Badji_Mokhtar_de_Annaba","Interdisciplinaire Entreprenariat","Université Badji Mokhtar de Annaba"]
[623,"Université_Badji_Mokhtar_de_Annaba","Linguistique Et Langue Arabe","Université Badji Mokhtar de Annaba"]
[624,"Université_Badji_Mokhtar_de_Annaba","Littérature Générale Et Comparée","Université Badji Mokhtar de Annaba"]
[625,"Université_Badji_Mokhtar_de_Annaba","Magnétisme Et Spectroscopie Des Solides","Université Badji Mokhtar de Annaba"]
[626,"Université_Badji_Mokhtar_de_Annaba","Management Des Organisations","Université Badji Mokhtar de Annaba"]
[627,"Université_Badji_Mokhtar_de_Annaba","Matériaux Avancés","Université Badji Mokhtar de Annaba"]
[628,"Université_Badji_Mokhtar_de_Annaba","Mathématiques Appliquées","Université Badji Mokhtar de Annaba"]
[629,"Université_Badji_Mokhtar_de_Annaba","Métallurgie Et Génie Des Matériaux","Université Badji Mokhtar de Annaba"]
[630,"Université_Badji_Mokhtar_de_Annaba","Physique Des Rayonnements","Université Badji Mokhtar de Annaba"]
[631,"Université_Badji_Mokhtar_de_Annaba","Ressources Naturelles Et Aménagement","Université Badji Mokhtar de Annaba"]
[632,"Université_Badji_Mokhtar_de_Annaba","Santé Bucco-Dentaire","Université Badji Mokhtar de Annaba"]
[633,"Université_Badji_Mokhtar_de_Annaba","Santé Et Environnement","Université Badji Mokhtar de Annaba"]
[634,"Université_Badji_Mokhtar_de_Annaba","Semi-Conducteurs","Université Badji Mokhtar de Annaba"]
[635,"Université_Badji_Mokhtar_de_Annaba","Traitement Des Eaux Et Valorisation Des Déchets Industriels","Université Badji Mokhtar de Annaba"]
[636,"Université_Badji_Mokhtar_de_Annaba","Automatique Et Signaux","Université Badji Mokhtar de Annaba"]
[637,"Université_Badji_Mokhtar_de_Annaba","Biochimie Et Microbiologie Appliquée","Université Badji Mokhtar de Annaba"]
[638,"Université_Badji_Mokhtar_de_Annaba","Ecobiologie Des Milieux Marins Et Littoraux","Université Badji Mokhtar de Annaba"]
[639,"Université_Badji_Mokhtar_de_Annaba","Mécanique Des Matériaux Et Maintenance Industrielle","Université Badji Mokhtar de Annaba"]
[640,"Université_Badji_Mokhtar_de_Annaba","Synthèse Biocatalyse Organique","Université Badji Mokhtar de Annaba"]
[641,"Université_Badji_Mokhtar_de_Annaba","Systèmes Electromécaniques","Université Badji Mokhtar de Annaba"]
[642,"Université_Badji_Mokhtar_de_Annaba","Architecture Et Urbanisme","Université Badji Mokhtar de Annaba"]
[643,"Université_Badji_Mokhtar_de_Annaba","Développement Et Les Grands Changements Dans La Société Cas : Annaba","Université Badji Mokhtar de Annaba"]
[644,"Université_Badji_Mokhtar_de_Annaba","Ecophysiologie Animale","Université Badji Mokhtar de Annaba"]
[645,"Université_Badji_Mokhtar_de_Annaba","Etudes Économiques","Université Badji Mokhtar de Annaba"]
[646,"Université_Badji_Mokhtar_de_Annaba","Langues Étrangères, Civilisation Universelle, Communication Et Réalité Algérienne","Université Badji Mokhtar de Annaba"]
[647,"Université_Badji_Mokhtar_de_Annaba","Toxicologie Cellulaire","Université Badji Mokhtar de Annaba"]
[648,"Université_Badji_Mokhtar_de_Annaba","Violence, Éducation Et Criminalité Dans La Société","Université Badji Mokhtar de Annaba"]
[649,"Université_Badji_Mokhtar_de_Annaba","Analyse Numérique, Optimisation Et Statistiques","Université Badji Mokhtar de Annaba"]
[650,"Université_Badji_Mokhtar_de_Annaba","Bioressources Marines","Université Badji Mokhtar de Annaba"]
[651,"Université_Badji_Mokhtar_de_Annaba","Ecologie Des Systèmes Terrestres Et Aquatiques","Université Badji Mokhtar de Annaba"]
[652,"Université_Badji_Mokhtar_de_Annaba","Fonderie","Université Badji Mokhtar de Annaba"]
[653,"Université_Badji_Mokhtar_de_Annaba","Sécurité Environnementale Et Alimentaire","Université Badji Mokhtar de Annaba"]
[654,"Université_Badji_Mokhtar_de_Annaba","Mécanique Industrielle","Université Badji Mokhtar de Annaba"]
[655,"Université_Badji_Mokhtar_de_Annaba","Métallurgie Physiqe Et Propriété Des Materiaux","Université Badji Mokhtar de Annaba"]
[656,"Université_Badji_Mokhtar_de_Annaba","Géologie","Université Badji Mokhtar de Annaba"]
[657,"Université_Badji_Mokhtar_de_Annaba","Chimie Des Matériaux Inorganiques","Université Badji Mokhtar de Annaba"]
[658,"Université_Badji_Mokhtar_de_Annaba","Langues Et Textes","Université Badji Mokhtar de Annaba"]
[659,"Université_Badji_Mokhtar_de_Annaba","Physique Des Lasers, De Spectroscopie Optique Et D'Optoelectronique","Université Badji Mokhtar de Annaba"]
[660,"Université_Badji_Mokhtar_de_Annaba","Elaboration Et Analyse Des Matériaux","Université Badji Mokhtar de Annaba"]
[661,"Université_Badji_Mokhtar_de_Annaba","Etudes Et Recherches En Instrumentation Et Communication","Université Badji Mokhtar de Annaba"]
[662,"Université_Badji_Mokhtar_de_Annaba","Gestion Électronique Des Documents","Université Badji Mokhtar de Annaba"]
[663,"Université_Badji_Mokhtar_de_Annaba","Amélioration Génétique Des Plantes","Université Badji Mokhtar de Annaba"]
[664,"Université_Badji_Mokhtar_de_Annaba","Neuro-Endocrinologie","Université Badji Mokhtar de Annaba"]
[665,"Université_Badji_Mokhtar_de_Annaba","Onco-Urologie Appliquée","Université Badji Mokhtar de Annaba"]
[666,"Université_Badji_Mokhtar_de_Annaba","Physique Du Solide","Université Badji Mokhtar de Annaba"]
[667,"Université_Badji_Mokhtar_de_Annaba","Poétique Et Analyse De Discours","Université Badji Mokhtar de Annaba"]
[668,"Université_Badji_Mokhtar_de_Annaba","Etude Juridique Maghrébine","Université Badji Mokhtar de Annaba"]
[669,"Université_Badji_Mokhtar_de_Annaba","Hydraulique Et Constructions Hydrauliques","Université Badji Mokhtar de Annaba"]
[670,"Université_Badji_Mokhtar_de_Annaba","Finance Internationale Et Etude Sur La Gouvernance Et L'Emergence (Lfiege)","Université Badji Mokhtar de Annaba"]
[671,"Université_Badji_Mokhtar_de_Annaba","Geodynamique Et Ressources Naturelles","Université Badji Mokhtar de Annaba"]
[672,"Université_Badji_Mokhtar_de_Annaba","Innovation Et Analyse Economique Et Financiere","Université Badji Mokhtar de Annaba"]
[673,"Université_Badji_Mokhtar_de_Annaba","Mathématiques, Dynamique & Modélisation","Université Badji Mokhtar de Annaba"]
[674,"Université_Badji_Mokhtar_de_Annaba","Réseaux Et Systèmes","Université Badji Mokhtar de Annaba"]
[675,"Université_Badji_Mokhtar_de_Annaba","Analyses Biogéochimiques Et Écologiques Des Environnements Aquatiques","Université Badji Mokhtar de Annaba"]
[676,"Université_Badji_Mokhtar_de_Annaba","Aquaculture Et Pathologies","Université Badji Mokhtar de Annaba"]
[677,"Université_Badji_Mokhtar_de_Annaba","Biochimie Et Toxicologie Environnementale","Université Badji Mokhtar de Annaba"]
[678,"Université_Badji_Mokhtar_de_Annaba","Biologie Moléculaire, Diagnostic Et Polymorphisme Des Antigènes","Université Badji Mokhtar de Annaba"]
[679,"Université_Badji_Mokhtar_de_Annaba","Catalyse Asymétrique Éco-Compatible","Université Badji Mokhtar de Annaba"]
[680,"Université_Badji_Mokhtar_de_Annaba","Développement Durable Et La Bonne Gouvernance Au Sud De La Méditerranée","Université Badji Mokhtar de Annaba"]
[681,"Université_Badji_Mokhtar_de_Annaba","Electrotechnique D'Annaba","Université Badji Mokhtar de Annaba"]
[682,"Université_Badji_Mokhtar_de_Annaba","Etudes Sociales Et Humaines Et Analyse Des Activités Physiques Et Sportives","Université Badji Mokhtar de Annaba"]
[683,"Université_Badji_Mokhtar_de_Annaba","Genie Electromecanique","Université Badji Mokhtar de Annaba"]
[684,"Université_Badji_Mokhtar_de_Annaba","Ingénierie Des Surfaces","Université Badji Mokhtar de Annaba"]
[685,"Université_Badji_Mokhtar_de_Annaba","Matériaux , Géomatériaux Et Environnement","Université Badji Mokhtar de Annaba"]
[686,"Université_Badji_Mokhtar_de_Annaba","Mise En Forme Des Matériaux Métalliques","Université Badji Mokhtar de Annaba"]
[687,"Université_Badji_Mokhtar_de_Annaba","Modélisation Mathématique Et Simulation Numérique","Université Badji Mokhtar de Annaba"]
[688,"Université_Badji_Mokhtar_de_Annaba","Probabilités Et Statistique","Université Badji Mokhtar de Annaba"]
[689,"Université_Badji_Mokhtar_de_Annaba","Ressources En Eau Et Developpement Durable","Université Badji Mokhtar de Annaba"]
[690,"Université_Badji_Mokhtar_de_Annaba","Risques Industriels / Cnd / Sureté De Fonctionnement","Université Badji Mokhtar de Annaba"]
[691,"Université_Badji_Mokhtar_de_Annaba","Sols Et Developpement Durable","Université Badji Mokhtar de Annaba"]
[692,"Université_Badji_Mokhtar_de_Annaba","Sols Et Hydraulique","Université Badji Mokhtar de Annaba"]
[693,"Université_Badji_Mokhtar_de_Annaba","Synthèse Organique, Modélisation Et Optimisation Des Procédés Chimiques","Université Badji Mokhtar de Annaba"]
[694,"Université_Badji_Mokhtar_de_Annaba","Systèmes Embarqués","Université Badji Mokhtar de Annaba"]
[695,"Université_Badji_Mokhtar_de_Annaba","Technologies Avancées En Production Mécanique","Université Badji Mokhtar de Annaba"]
[696,"Université_Badji_Mokhtar_de_Annaba","Traduction Et Didactique Des Langues (Tradil)","Université Badji Mokhtar de Annaba"]
[697,"Université_Badji_Mokhtar_de_Annaba","Analyses Urbaines Et Environnementales","Université Badji Mokhtar de Annaba"]
[698,"Université_Badji_Mokhtar_de_Annaba","Développement Et De Contrôle Des Préparations Pharmaceutiques Hospitalières","Université Badji Mokhtar de Annaba"]
[699,"Université_Badji_Mokhtar_de_Annaba","Ingénierie Des Systèmes Complexes","Université Badji Mokhtar de Annaba"]
[700,"Université_Badji_Mokhtar_de_Annaba","Intelligence Économique Et Développement Durable","Université Badji Mokhtar de Annaba"]
[701,"Université_Badji_Mokhtar_de_Annaba","Interdisciplinaire De Pédagogie Et De Didactique","Université Badji Mokhtar de Annaba"]
[702,"Université_Badji_Mokhtar_de_Annaba","Nanomatériaux- Corrosion Et Traitements De Surfaces","Université Badji Mokhtar de Annaba"]
[703,"Université_Badji_Mokhtar_de_Annaba","Neuro-Urologie","Université Badji Mokhtar de Annaba"]
[704,"Université_Badji_Mokhtar_de_Annaba","Ville, Patrimoine Architectural,Urbain Et Paysager","Université Badji Mokhtar de Annaba"]
[705,"Université_Badji_Mokhtar_de_Annaba","Valorisation Des Ressources Minières Et Environnement","Université Badji Mokhtar de Annaba"]
[706,"Université_Badji_Mokhtar_de_Annaba","Analyse du travail et I' etudes ergonomique","Université Badji Mokhtar de Annaba"]
[707,"Université_Badji_Mokhtar_de_Annaba","Biosurveillance Environnementale","Université Badji Mokhtar de Annaba"]
[708,"Université_Batna_2","Systèmes Propulsion - Induction Electromagnétiques","Université Batna 2"]
[709,"Université_Batna_2","Automatique Et Productique","Université Batna 2"]
[710,"Université_Batna_2","Electronique Avancée","Université Batna 2"]
[711,"Université_Batna_2","Electrotechnique De Batna","Université Batna 2"]
[712,"Université_Batna_2","Etudes Des Systèmes Énergétiques Industriels","Université Batna 2"]
[713,"Université_Batna_2","Productique","Université Batna 2"]
[714,"Université_Batna_2","Risques Naturels Et Aménagement Du Territoire","Université Batna 2"]
[715,"Université_Batna_2","Techniques Mathématiques En Vue D'Applications, Aspects Déterministes Et Stochastiques","Université Batna 2"]
[716,"Université_Batna_2","Hydraulique Appliquée","Université Batna 2"]
[717,"Université_Batna_2","Prévention Industrielle","Université Batna 2"]
[718,"Université_Batna_2","Biotechnologie Des Molécules Bioactives Et De La Physiopathologie Cellulaire","Université Batna 2"]
[719,"Université_Batna_2","Dimension Interculturelle Dans L'Enseignement Du Français Langue Etrangère","Université Batna 2"]
[720,"Université_Batna_2","Hépatites Virales","Université Batna 2"]
[721,"Université_Batna_2","Mécanique Des Structures Et Matériaux","Université Batna 2"]
[722,"Université_Batna_2","Applications Des Mathématiques À L’Informatique Et À L’Électronique","Université Batna 2"]
[723,"Université_Batna_2","Equations Aux Dérivées Partielles Et Applications","Université Batna 2"]
[724,"Université_Batna_2","Gestion Des Risques Liés Aux Infections Associées Aux Soins","Université Batna 2"]
[725,"Université_Batna_2","Sciences Technologiques Des Activités Sportives Educatives","Université Batna 2"]
[726,"Université_Batna_2","Strategies D'Enseignement De La Literatture: Une Notion En Mouvement","Université Batna 2"]
[727,"Université_Batna_2","Systèmes De Traction Électriques – Batna","Université Batna 2"]
[728,"Université_Batna_2","Systèmes Et Technologies De L’Information Et De La Communication","Université Batna 2"]
[729,"Université_Batna_2","Automatique Avancée Et D'Analyse Des Systèmes","Université Batna 2"]
[730,"Université_Batna_2","E- Learning And The Teaching Of Language And Culture. ","Université Batna 2"]
[731,"Université_Batna_2","Innovation En Construction Éco-Conception Et Génie Sismique","Université Batna 2"]
[732,"Université_Batna_2","Mobilisation Et Gestion Des Ressources En Eau","Université Batna 2"]
[733,"Université_Batna_2","Physio-Toxicologie, Pathologie Cellulaires Et Moléculaires-Biomolécules","Université Batna 2"]
[734,"Université_Benyoucef_Benkhedda_Alger","Chariaa","Université Benyoucef Benkhedda Alger"]
[735,"Université_Benyoucef_Benkhedda_Alger","Biochimie Génétique","Université Benyoucef Benkhedda Alger"]
[736,"Université_Benyoucef_Benkhedda_Alger","Chirurgie D'Exerece Hépatique Majeure","Université Benyoucef Benkhedda Alger"]
[737,"Université_Benyoucef_Benkhedda_Alger","Etude Du Polymorphisme Génétique","Université Benyoucef Benkhedda Alger"]
[738,"Université_Benyoucef_Benkhedda_Alger","Hélicobacters","Université Benyoucef Benkhedda Alger"]
[739,"Université_Benyoucef_Benkhedda_Alger","Laboratoire Algérien De Recherche Sur L'Hélicobacter","Université Benyoucef Benkhedda Alger"]
[740,"Université_Benyoucef_Benkhedda_Alger","Propriété Intellectuelle","Université Benyoucef Benkhedda Alger"]
[741,"Université_Benyoucef_Benkhedda_Alger","Oncologie Moléculaire Fondamentale Et Appliquée","Université Benyoucef Benkhedda Alger"]
[742,"Université_Benyoucef_Benkhedda_Alger","Maladies Inflammatoires Cryptogénetiques","Université Benyoucef Benkhedda Alger"]
[743,"Université_Benyoucef_Benkhedda_Alger","Biochimie Et Génétique Moléculaire","Université Benyoucef Benkhedda Alger"]
[744,"Université_Benyoucef_Benkhedda_Alger","Immunologie Plaquettaire","Université Benyoucef Benkhedda Alger"]
[745,"Université_Benyoucef_Benkhedda_Alger","Maladies Respiratoires Non Transmissibles","Université Benyoucef Benkhedda Alger"]
[746,"Université_Benyoucef_Benkhedda_Alger","Neuro-Sciences","Université Benyoucef Benkhedda Alger"]
[747,"Université_Benyoucef_Benkhedda_Alger","Biogenotoxicologie Et Santé Au Travail","Université Benyoucef Benkhedda Alger"]
[748,"Université_Benyoucef_Benkhedda_Alger","Doctrine Malitike Dans Le Monde Islamique, Son Histoire, Ses Savants , Effets Et Perspectives","Université Benyoucef Benkhedda Alger"]
[749,"Université_Benyoucef_Benkhedda_Alger","Endocrinologie Et Métabolisme","Université Benyoucef Benkhedda Alger"]
[750,"Université_Benyoucef_Benkhedda_Alger","Méthodes De Recherche En Sciences Islamiques , Leur Finalité Et Style D'Evaluation","Université Benyoucef Benkhedda Alger"]
[751,"Université_Benyoucef_Benkhedda_Alger","Questions Contemporaines: Dimensions Religieuses, Juridiques Et Intellectuelles","Université Benyoucef Benkhedda Alger"]
[752,"Université_Benyoucef_Benkhedda_Alger","Surveillance De La Tuberculose","Université Benyoucef Benkhedda Alger"]
[753,"Université_Benyoucef_Benkhedda_Alger","Cardio Oncologie Collaborative Research Group","Université Benyoucef Benkhedda Alger"]
[754,"Université_Benyoucef_Benkhedda_Alger","Diabetes And Pregnancy Collaborative Research Group","Université Benyoucef Benkhedda Alger"]
[755,"Université_Benyoucef_Benkhedda_Alger","Biopathologie Et Cancer","Université Benyoucef Benkhedda Alger"]
[756,"Université_Benyoucef_Benkhedda_Alger","Risque Cardiovasculaire En Néphrologie Et Transplantation","Université Benyoucef Benkhedda Alger"]
[757,"Université_Benyoucef_Benkhedda_Alger","Sénologie Interventionnelle Guidée Par Imagerie Médicale Dans Le Diagnostic Précoce Et Le Traitement Du Cancer Du Sein","Université Benyoucef Benkhedda Alger"]
[758,"Université_Benyoucef_Benkhedda_Alger","Simulation En Anesthesie Reanimation Et Médecine D’Urgence","Université Benyoucef Benkhedda Alger"]
[759,"Université_Benyoucef_Benkhedda_Alger","Sciences Criminelles","Université Benyoucef Benkhedda Alger"]
[760,"Université_Chadli_Bendjedid_El_Tarf","Santé Animale, Productions Agricoles, Environnement Et Sécurité Alimentaire","Université Chadli Bendjedid El Tarf"]
[761,"Université_Chadli_Bendjedid_El_Tarf","Biodiversité Et La Pollution Des Écosystèmes","Université Chadli Bendjedid El Tarf"]
[762,"Université_Chadli_Bendjedid_El_Tarf","Productions Animales, Biotechnologie Et Santé","Université Chadli Bendjedid El Tarf"]
[763,"Université_Chadli_Bendjedid_El_Tarf","Agriculture Et Fonctionnement Des Écosystèmes","Université Chadli Bendjedid El Tarf"]
[764,"Université_Chadli_Bendjedid_El_Tarf","Ecologie Fonctionnelle Et Évolutive ","Université Chadli Bendjedid El Tarf"]
[765,"Université_Chadli_Bendjedid_El_Tarf","Epidèmio-Surveillance, Santé, Production Et Reproduction Expérimentation Et Thérapie Cellulaire Des Animaux","Université Chadli Bendjedid El Tarf"]
[766,"Université_Chadli_Bendjedid_El_Tarf","Physico-Chimie Des Materiaux","Université Chadli Bendjedid El Tarf"]
[767,"Université_Chadli_Bendjedid_El_Tarf","Patrimoine et études linguistiques","Université Chadli Bendjedid El Tarf"]
[768,"Université_de_Abdelhamid_Mehri_de_Constantine_2","Etudes Historiques Et Philosophiques","Université de Abdelhamid Mehri de Constantine 2"]
[769,"Université_de_Abdelhamid_Mehri_de_Constantine_2","Grand Maghreb : Economie Et Société","Université de Abdelhamid Mehri de Constantine 2"]
[770,"Université_de_Abdelhamid_Mehri_de_Constantine_2","Informatique Repartie","Université de Abdelhamid Mehri de Constantine 2"]
[771,"Université_de_Abdelhamid_Mehri_de_Constantine_2","Pratiques Psychologiques Et Educatives","Université de Abdelhamid Mehri de Constantine 2"]
[772,"Université_de_Abdelhamid_Mehri_de_Constantine_2","Analyse Des Processus Sociaux Et Institutionnels","Université de Abdelhamid Mehri de Constantine 2"]
[773,"Université_de_Abdelhamid_Mehri_de_Constantine_2","Nouvelle Technologie De L'Information Et Le Développement National","Université de Abdelhamid Mehri de Constantine 2"]
[774,"Université_de_Abdelhamid_Mehri_de_Constantine_2","Sciences Sociales Et Problème De Société","Université de Abdelhamid Mehri de Constantine 2"]
[775,"Université_de_Abdelhamid_Mehri_de_Constantine_2","Economie Et Management","Université de Abdelhamid Mehri de Constantine 2"]
[776,"Université_de_Abdelhamid_Mehri_de_Constantine_2","Homme Et La Ville","Université de Abdelhamid Mehri de Constantine 2"]
[777,"Université_de_Abdelhamid_Mehri_de_Constantine_2","Violence Et Education À La Citoyenneté","Université de Abdelhamid Mehri de Constantine 2"]
[778,"Université_de_Abdelhamid_Mehri_de_Constantine_2","Etude Et De Recherche Socio-Historique Sur Les Mouvements Migratoires","Université de Abdelhamid Mehri de Constantine 2"]
[779,"Université_de_Abdelhamid_Mehri_de_Constantine_2","Etudes Et Recherche Sur Civilisation Du Maghreb Islamique","Université de Abdelhamid Mehri de Constantine 2"]
[780,"Université_de_Abdelhamid_Mehri_de_Constantine_2","Formation En Psychopathologie Et Psychothérapie","Université de Abdelhamid Mehri de Constantine 2"]
[781,"Université_de_Abdelhamid_Mehri_de_Constantine_2","Psychopathologie : Violence Corporelle & Traumatisme Psychique","Université de Abdelhamid Mehri de Constantine 2"]
[782,"Université_de_Abdelhamid_Mehri_de_Constantine_2","Etude Et Recherche Sur L'Information Et La Documentation Scientifique Et Technologique","Université de Abdelhamid Mehri de Constantine 2"]
[783,"Université_de_Abdelhamid_Mehri_de_Constantine_2","Vers Une Société Algérienne D'Information : Fondement, Objectif Et Reconstitution","Université de Abdelhamid Mehri de Constantine 2"]
[784,"Université_de_Abdelhamid_Mehri_de_Constantine_2","Modélisation Et Implémentation Des Systèmes Complexes","Université de Abdelhamid Mehri de Constantine 2"]
[785,"Université_de_Abdelhamid_Mehri_de_Constantine_2","Sociologie Économique Et Des Mouvements Sociaux","Université de Abdelhamid Mehri de Constantine 2"]
[786,"Université_de_Abdelhamid_Mehri_de_Constantine_2","Philosophie Des Sciences Humaines","Université de Abdelhamid Mehri de Constantine 2"]
[787,"Université_de_Abdelhamid_Mehri_de_Constantine_2","Histoire, Patrimoine Et Société","Université de Abdelhamid Mehri de Constantine 2"]
[788,"Université_de_Abdelhamid_Mehri_de_Constantine_2","Psychologie Du Travail & Management Des Organisations","Université de Abdelhamid Mehri de Constantine 2"]
[789,"Université_de_Abdelhamid_Mehri_de_Constantine_2","Etudes Et Recherches En Marketing","Université de Abdelhamid Mehri de Constantine 2"]
[790,"Université_de_Abdelhamid_Mehri_de_Constantine_2","Education, Formation et Développement","Université de Abdelhamid Mehri de Constantine 2"]
[791,"Université_de_Abdelhamid_Mehri_de_Constantine_2","Expertise et d’Analyse de la Performance Sportive","Université de Abdelhamid Mehri de Constantine 2"]
[792,"Université_de_Abdelhamid_Mehri_de_Constantine_2","Psychologie de l’Adolescent","Université de Abdelhamid Mehri de Constantine 2"]
[793,"Université_de_Constantine_3","Alimentation, Nutrition Et Santé","Université de Constantine 3"]
[794,"Université_de_Constantine_3","Biologie Et Génétique Moléculaire","Université de Constantine 3"]
[795,"Université_de_Constantine_3","Diabète Sucré","Université de Constantine 3"]
[796,"Université_de_Constantine_3","Sociologie De La Communication Recherche Et Traduction","Université de Constantine 3"]
[797,"Université_de_Constantine_3","Technique De L'Évaluation Médicale","Université de Constantine 3"]
[798,"Université_de_Constantine_3","Ingénierie Des Procédés De L'Environnement","Université de Constantine 3"]
[799,"Université_de_Constantine_3","Ville Et Patrimoine","Université de Constantine 3"]
[800,"Université_de_Constantine_3","Urbanisme Et Environnement","Université de Constantine 3"]
[801,"Université_de_Constantine_3","Architecture Bioclimatique Et Environnement","Université de Constantine 3"]
[802,"Université_de_Constantine_3","Maladies Métaboliques Études Cliniques Biologiques, Fonctionnelles Et Génétiques","Université de Constantine 3"]
[803,"Université_de_Constantine_3","Villes Et Santé","Université de Constantine 3"]
[804,"Université_de_Constantine_3","Architecture De L'Urbanisme : Espace Technique Et Société","Université de Constantine 3"]
[805,"Université_de_Constantine_3","Energie Et Environnement","Université de Constantine 3"]
[806,"Université_de_Constantine_3","Evaluation De La Perfeormance Architecturale Et Durabilité Environnementale","Université de Constantine 3"]
[807,"Université_de_Constantine_3","Médecine Préventive Des Affections Chroniques","Université de Constantine 3"]
[808,"Université_de_Constantine_3","Risques Professionnels Et Santé","Université de Constantine 3"]
[809,"Université_de_Constantine_3","Architecture, Ville, Métiers Et Formation","Université de Constantine 3"]
[810,"Université_de_Ghardaïa","Interdisciplinaire, Tourisme, Territoires, Sociétés","Université de Ghardaïa"]
[811,"Université_de_Ghardaïa","Histoire Et Civilisation Musulmane","Université de Ghardaïa"]
[812,"Université_de_Ghardaïa","Mathématiques Et Sciences Appliquées","Université de Ghardaïa"]
[813,"Université_de_Ghardaïa","Développement managerial pour promouvoir les entreprises économiques dans la wilaya de Ghardaia.","Université de Ghardaïa"]
[814,"Université_de_Ghardaïa","Patrimoine Culturel, Linguistique et Littérature dans les Régions du Sud Algérien","Université de Ghardaïa"]
[815,"Université_de_Khenchela","Structures, Propriétés Et Interactions Interatomiques","Université de Khenchela"]
[816,"Université_de_Khenchela","Analyse Du Discours Et Traduction","Université de Khenchela"]
[817,"Université_de_Khenchela","Incubateurs D'Entreprises Et Développements Local","Université de Khenchela"]
[818,"Université_de_Khenchela","Violence, Communication, Phénomène Religieux Et Impact Socio-Économique","Université de Khenchela"]
[819,"Université_de_Khenchela","Capteurs, Instrumentations Et Procédés","Université de Khenchela"]
[820,"Université_de_Khenchela","Ingénierie Des Connaissances Et Sécurité Informatique (Icosi)","Université de Khenchela"]
[821,"Université_de_Khenchela","Juridiques Politiques Et Charia","Université de Khenchela"]
[822,"Université_de_Khenchela","L’Interprétation Et Les Études Culturelles Comparées","Université de Khenchela"]
[823,"Université_de_Khenchela","Ingénierie et Sciences  des Matériaux  Avancés","Université de Khenchela"]
[824,"Centre_Universitaire_de_Tamanrasset","Héritage Scientifique Et Culturel De La Région De Tamanrasset","Centre Universitaire de Tamanrasset"]
[825,"Centre_Universitaire_de_Tamanrasset","Sciences Et Environnement : Bioressources, Gèochimie- Physique, Législation Et Dèveloppement Socio-Économique","Centre Universitaire de Tamanrasset"]
[826,"Université_des_Sciences_et_de_la_Technologie_Houari_Boumediène_USTHB","Algèbre Et Théorie Des Nombres","Université des Sciences et de la Technologie Houari Boumediène USTHB"]
[827,"Université_des_Sciences_et_de_la_Technologie_Houari_Boumediène_USTHB","Analyse Mathématique Et Numérique Des Équations Aux Dérivées Partielles","Université des Sciences et de la Technologie Houari Boumediène USTHB"]
[828,"Université_des_Sciences_et_de_la_Technologie_Houari_Boumediène_USTHB","Analyse Organique Fonctionnelle","Université des Sciences et de la Technologie Houari Boumediène USTHB"]
[829,"Université_des_Sciences_et_de_la_Technologie_Houari_Boumediène_USTHB","Bâti Dans L'Environnement","Université des Sciences et de la Technologie Houari Boumediène USTHB"]
[830,"Université_des_Sciences_et_de_la_Technologie_Houari_Boumediène_USTHB","Biologie Cellulaire Et Moléculaire","Université des Sciences et de la Technologie Houari Boumediène USTHB"]
[831,"Université_des_Sciences_et_de_la_Technologie_Houari_Boumediène_USTHB","Biologie Et Physiologie Des Organismes","Université des Sciences et de la Technologie Houari Boumediène USTHB"]
[832,"Université_des_Sciences_et_de_la_Technologie_Houari_Boumediène_USTHB","Chimie Du Gaz Naturel","Université des Sciences et de la Technologie Houari Boumediène USTHB"]
[833,"Université_des_Sciences_et_de_la_Technologie_Houari_Boumediène_USTHB","Chimie Organique Appliquée","Université des Sciences et de la Technologie Houari Boumediène USTHB"]
[834,"Université_des_Sciences_et_de_la_Technologie_Houari_Boumediène_USTHB","Chromatographie","Université des Sciences et de la Technologie Houari Boumediène USTHB"]
[835,"Université_des_Sciences_et_de_la_Technologie_Houari_Boumediène_USTHB","Communication Parlée Et Traitement Des Signaux","Université des Sciences et de la Technologie Houari Boumediène USTHB"]
[836,"Université_des_Sciences_et_de_la_Technologie_Houari_Boumediène_USTHB","Cristallographie - Thermodynamique","Université des Sciences et de la Technologie Houari Boumediène USTHB"]
[837,"Université_des_Sciences_et_de_la_Technologie_Houari_Boumediène_USTHB","Electrochimie - Corrosion, Métallurgie Et Chimie Minérale","Université des Sciences et de la Technologie Houari Boumediène USTHB"]
[838,"Université_des_Sciences_et_de_la_Technologie_Houari_Boumediène_USTHB","Electronique Quantique","Université des Sciences et de la Technologie Houari Boumediène USTHB"]
[839,"Université_des_Sciences_et_de_la_Technologie_Houari_Boumediène_USTHB","Environnement Géotechnique Et Hydraulique","Université des Sciences et de la Technologie Houari Boumediène USTHB"]
[840,"Université_des_Sciences_et_de_la_Technologie_Houari_Boumediène_USTHB","Etude Physico-Chimique Des Matériaux Et Application À L'Environnement","Université des Sciences et de la Technologie Houari Boumediène USTHB"]
[841,"Université_des_Sciences_et_de_la_Technologie_Houari_Boumediène_USTHB","Génie De La Réaction","Université des Sciences et de la Technologie Houari Boumediène USTHB"]
[842,"Université_des_Sciences_et_de_la_Technologie_Houari_Boumediène_USTHB","Géodynamique Des Bassins Sédimentaires Et Des Orogènes","Université des Sciences et de la Technologie Houari Boumediène USTHB"]
[843,"Université_des_Sciences_et_de_la_Technologie_Houari_Boumediène_USTHB","Géodynamique, Géologie De L'Ingénieur Et Planétologie","Université des Sciences et de la Technologie Houari Boumediène USTHB"]
[844,"Université_des_Sciences_et_de_la_Technologie_Houari_Boumediène_USTHB","Géophysique","Université des Sciences et de la Technologie Houari Boumediène USTHB"]
[845,"Université_des_Sciences_et_de_la_Technologie_Houari_Boumediène_USTHB","Hydrométallurgie Et Chimie Inorganique Moléculaire","Université des Sciences et de la Technologie Houari Boumediène USTHB"]
[846,"Université_des_Sciences_et_de_la_Technologie_Houari_Boumediène_USTHB","Instrumentation","Université des Sciences et de la Technologie Houari Boumediène USTHB"]
[847,"Université_des_Sciences_et_de_la_Technologie_Houari_Boumediène_USTHB","Intelligence Artificielle","Université des Sciences et de la Technologie Houari Boumediène USTHB"]
[848,"Université_des_Sciences_et_de_la_Technologie_Houari_Boumediène_USTHB","Mécanique Des Fluides Théorique Et Appliquée","Université des Sciences et de la Technologie Houari Boumediène USTHB"]
[849,"Université_des_Sciences_et_de_la_Technologie_Houari_Boumediène_USTHB","Modélisation Stochastique Et Traitement Des Données","Université des Sciences et de la Technologie Houari Boumediène USTHB"]
[850,"Université_des_Sciences_et_de_la_Technologie_Houari_Boumediène_USTHB","Phénomènes De Transfert","Université des Sciences et de la Technologie Houari Boumediène USTHB"]
[851,"Université_des_Sciences_et_de_la_Technologie_Houari_Boumediène_USTHB","Physique Des Matériaux","Université des Sciences et de la Technologie Houari Boumediène USTHB"]
[852,"Université_des_Sciences_et_de_la_Technologie_Houari_Boumediène_USTHB","Physique Théorique","Université des Sciences et de la Technologie Houari Boumediène USTHB"]
[853,"Université_des_Sciences_et_de_la_Technologie_Houari_Boumediène_USTHB","Robotique Parallélisme Et Électroénergétique","Université des Sciences et de la Technologie Houari Boumediène USTHB"]
[854,"Université_des_Sciences_et_de_la_Technologie_Houari_Boumediène_USTHB","Sciences Des Matériaux","Université des Sciences et de la Technologie Houari Boumediène USTHB"]
[855,"Université_des_Sciences_et_de_la_Technologie_Houari_Boumediène_USTHB","Sciences Du Génie Des Procédés Industriels","Université des Sciences et de la Technologie Houari Boumediène USTHB"]
[856,"Université_des_Sciences_et_de_la_Technologie_Houari_Boumediène_USTHB","Sciences Et Génie Des Matériaux","Université des Sciences et de la Technologie Houari Boumediène USTHB"]
[857,"Université_des_Sciences_et_de_la_Technologie_Houari_Boumediène_USTHB","Sciences Nucléaires Et Interaction - Rayonnement - Matière","Université des Sciences et de la Technologie Houari Boumediène USTHB"]
[858,"Université_des_Sciences_et_de_la_Technologie_Houari_Boumediène_USTHB","Stockage Et Valorisation Des Énergies Renouvelables","Université des Sciences et de la Technologie Houari Boumediène USTHB"]
[859,"Université_des_Sciences_et_de_la_Technologie_Houari_Boumediène_USTHB","Systèmes Dynamiques","Université des Sciences et de la Technologie Houari Boumediène USTHB"]
[860,"Université_des_Sciences_et_de_la_Technologie_Houari_Boumediène_USTHB","Systèmes Informatiques","Université des Sciences et de la Technologie Houari Boumediène USTHB"]
[861,"Université_des_Sciences_et_de_la_Technologie_Houari_Boumediène_USTHB","Traitement D'Images Et Rayonnement","Université des Sciences et de la Technologie Houari Boumediène USTHB"]
[862,"Université_des_Sciences_et_de_la_Technologie_Houari_Boumediène_USTHB","Transports Polyphasiques Et Milieux Poreux","Université des Sciences et de la Technologie Houari Boumediène USTHB"]
[863,"Université_des_Sciences_et_de_la_Technologie_Houari_Boumediène_USTHB","Zones Arides","Université des Sciences et de la Technologie Houari Boumediène USTHB"]
[864,"Université_des_Sciences_et_de_la_Technologie_Houari_Boumediène_USTHB","Mécanique Avancée","Université des Sciences et de la Technologie Houari Boumediène USTHB"]
[865,"Université_des_Sciences_et_de_la_Technologie_Houari_Boumediène_USTHB","Métallogénie Et Magmatisme De L'Algérie","Université des Sciences et de la Technologie Houari Boumediène USTHB"]
[866,"Université_des_Sciences_et_de_la_Technologie_Houari_Boumediène_USTHB","Matériaux Polymères","Université des Sciences et de la Technologie Houari Boumediène USTHB"]
[867,"Université_des_Sciences_et_de_la_Technologie_Houari_Boumediène_USTHB","Physico-Chimie Théorique Et Chimie Informatique","Université des Sciences et de la Technologie Houari Boumediène USTHB"]
[868,"Université_des_Sciences_et_de_la_Technologie_Houari_Boumediène_USTHB","Synthèse Macromoléculaire Et Thioorganique Macromoléculaire","Université des Sciences et de la Technologie Houari Boumediène USTHB"]
[869,"Université_des_Sciences_et_de_la_Technologie_Houari_Boumediène_USTHB","Thermodynamique Et Modélisation Moléculaire","Université des Sciences et de la Technologie Houari Boumediène USTHB"]
[870,"Université_des_Sciences_et_de_la_Technologie_Houari_Boumediène_USTHB","Thermodynamique Et Systèmes Energétiques","Université des Sciences et de la Technologie Houari Boumediène USTHB"]
[871,"Université_des_Sciences_et_de_la_Technologie_Houari_Boumediène_USTHB","Environnement, Eau, Géomécanique Et Ouvrages","Université des Sciences et de la Technologie Houari Boumediène USTHB"]
[872,"Université_des_Sciences_et_de_la_Technologie_Houari_Boumediène_USTHB","Géo-Environnement","Université des Sciences et de la Technologie Houari Boumediène USTHB"]
[873,"Université_des_Sciences_et_de_la_Technologie_Houari_Boumediène_USTHB","Systèmes Électriques Industriels","Université des Sciences et de la Technologie Houari Boumediène USTHB"]
[874,"Université_des_Sciences_et_de_la_Technologie_Houari_Boumediène_USTHB","Matériaux Catalytiques Et Catalyse En Chimie Organique","Université des Sciences et de la Technologie Houari Boumediène USTHB"]
[875,"Université_des_Sciences_et_de_la_Technologie_Houari_Boumediène_USTHB","Dynamique Et Biodiversité","Université des Sciences et de la Technologie Houari Boumediène USTHB"]
[876,"Université_des_Sciences_et_de_la_Technologie_Houari_Boumediène_USTHB","Ecologie Végétale Et Environnement","Université des Sciences et de la Technologie Houari Boumediène USTHB"]
[877,"Université_des_Sciences_et_de_la_Technologie_Houari_Boumediène_USTHB","Matériaux Semi-Conducteurs Et Oxydes Métalliques (Msom)","Université des Sciences et de la Technologie Houari Boumediène USTHB"]
[878,"Université_des_Sciences_et_de_la_Technologie_Houari_Boumediène_USTHB","Océanographie Biologique Et Environnement Marin","Université des Sciences et de la Technologie Houari Boumediène USTHB"]
[879,"Université_des_Sciences_et_de_la_Technologie_Houari_Boumediène_USTHB","Technologie Des Matériaux","Université des Sciences et de la Technologie Houari Boumediène USTHB"]
[880,"Université_des_Sciences_et_de_la_Technologie_Houari_Boumediène_USTHB","Aide Multicritère À La Décision Et Recherche Opérationnelle","Université des Sciences et de la Technologie Houari Boumediène USTHB"]
[881,"Université_des_Sciences_et_de_la_Technologie_Houari_Boumediène_USTHB","Arithmétique, Codage, Combinatoire Et Calcul Formel","Université des Sciences et de la Technologie Houari Boumediène USTHB"]
[882,"Université_des_Sciences_et_de_la_Technologie_Houari_Boumediène_USTHB","Biodiversité Et Environnement: Interactions, Génomes","Université des Sciences et de la Technologie Houari Boumediène USTHB"]
[883,"Université_des_Sciences_et_de_la_Technologie_Houari_Boumediène_USTHB","Chimie Théorique Computationnelle Et Photonique","Université des Sciences et de la Technologie Houari Boumediène USTHB"]
[884,"Université_des_Sciences_et_de_la_Technologie_Houari_Boumediène_USTHB","Informatique Fondamentale, Recherche Opérationnelle, Combinatoire Et Econométrie","Université des Sciences et de la Technologie Houari Boumediène USTHB"]
[885,"Université_des_Sciences_et_de_la_Technologie_Houari_Boumediène_USTHB","Recherche Opérationnelle Et Mathématiques De La Décision","Université des Sciences et de la Technologie Houari Boumediène USTHB"]
[886,"Université_des_Sciences_et_de_la_Technologie_Houari_Boumediène_USTHB","Études En Aménagement Et Urbanisme","Université des Sciences et de la Technologie Houari Boumediène USTHB"]
[887,"Université_des_Sciences_et_de_la_Technologie_Houari_Boumediène_USTHB","Geomorphologie Et Georisques","Université des Sciences et de la Technologie Houari Boumediène USTHB"]
[888,"Université_des_Sciences_et_de_la_Technologie_Houari_Boumediène_USTHB","Informatique Intelligente, Mathématiques Et Applications.","Université des Sciences et de la Technologie Houari Boumediène USTHB"]
[889,"Université_des_Sciences_et_de_la_Technologie_Houari_Boumediène_USTHB","Mécanique Énergétique Et Systèmes De Conversion","Université des Sciences et de la Technologie Houari Boumediène USTHB"]
[890,"Université_des_Sciences_et_de_la_Technologie_Houari_Boumediène_USTHB","Modélisation, Vérification Et Evaluation Des Performances Des Systèmes Complexes","Université des Sciences et de la Technologie Houari Boumediène USTHB"]
[891,"Université_des_Sciences_et_de_la_Technologie_Houari_Boumediène_USTHB","Opérationnelle,De Combinatoire,D'Informatiquethéorique Et De Méthodes Stochastiques","Université des Sciences et de la Technologie Houari Boumediène USTHB"]
[892,"Université_des_Sciences_et_de_la_Technologie_Houari_Boumediène_USTHB","Villes, Régions Et Gouvernance Territoriale","Université des Sciences et de la Technologie Houari Boumediène USTHB"]
[893,"Université_des_Sciences_et_de_la_Technologie_Houari_Boumediène_USTHB","Ingénierie Des Systèmes Intelligents Et Communicants","Université des Sciences et de la Technologie Houari Boumediène USTHB"]
[894,"Université_des_Sciences_et_de_la_Technologie_Mohamed_Boudiaf_Oran","Analyse Et Application Des Rayonnements","Université des Sciences et de la Technologie Mohamed Boudiaf Oran"]
[895,"Université_des_Sciences_et_de_la_Technologie_Mohamed_Boudiaf_Oran","Carburants Gazeux & Environnement","Université des Sciences et de la Technologie Mohamed Boudiaf Oran"]
[896,"Université_des_Sciences_et_de_la_Technologie_Mohamed_Boudiaf_Oran","Développement Des Entraînements Électriques","Université des Sciences et de la Technologie Mohamed Boudiaf Oran"]
[897,"Université_des_Sciences_et_de_la_Technologie_Mohamed_Boudiaf_Oran","Etude Physique Des Matériaux","Université des Sciences et de la Technologie Mohamed Boudiaf Oran"]
[898,"Université_des_Sciences_et_de_la_Technologie_Mohamed_Boudiaf_Oran","Matériaux Sols Et Thermique","Université des Sciences et de la Technologie Mohamed Boudiaf Oran"]
[899,"Université_des_Sciences_et_de_la_Technologie_Mohamed_Boudiaf_Oran","Mécanique Des Structures Et Stabilité Des Constructions","Université des Sciences et de la Technologie Mohamed Boudiaf Oran"]
[900,"Université_des_Sciences_et_de_la_Technologie_Mohamed_Boudiaf_Oran","Microscopie Électronique Et Sciences Des Matériaux","Université des Sciences et de la Technologie Mohamed Boudiaf Oran"]
[901,"Université_des_Sciences_et_de_la_Technologie_Mohamed_Boudiaf_Oran","Physico-Chimie Des Matériaux : Catalyse Et Environnement","Université des Sciences et de la Technologie Mohamed Boudiaf Oran"]
[902,"Université_des_Sciences_et_de_la_Technologie_Mohamed_Boudiaf_Oran","Physique Des Plasmas, Des Matériaux Conducteurs Et Leurs Applications","Université des Sciences et de la Technologie Mohamed Boudiaf Oran"]
[903,"Université_des_Sciences_et_de_la_Technologie_Mohamed_Boudiaf_Oran","Signaux Et Images","Université des Sciences et de la Technologie Mohamed Boudiaf Oran"]
[904,"Université_des_Sciences_et_de_la_Technologie_Mohamed_Boudiaf_Oran","Systèmes Intelligents (Laresi)","Université des Sciences et de la Technologie Mohamed Boudiaf Oran"]
[905,"Université_des_Sciences_et_de_la_Technologie_Mohamed_Boudiaf_Oran","Mécanique Appliquée","Université des Sciences et de la Technologie Mohamed Boudiaf Oran"]
[906,"Université_des_Sciences_et_de_la_Technologie_Mohamed_Boudiaf_Oran","Modélisation Et Optimisation Des Systèmes Industriels","Université des Sciences et de la Technologie Mohamed Boudiaf Oran"]
[907,"Université_des_Sciences_et_de_la_Technologie_Mohamed_Boudiaf_Oran","Rhéologie - Transport Et Traitement Des Fluides Complexes","Université des Sciences et de la Technologie Mohamed Boudiaf Oran"]
[908,"Université_des_Sciences_et_de_la_Technologie_Mohamed_Boudiaf_Oran","Génie Electrique D'Oran (Lgeo)","Université des Sciences et de la Technologie Mohamed Boudiaf Oran"]
[909,"Université_des_Sciences_et_de_la_Technologie_Mohamed_Boudiaf_Oran","Signal-Image-Parole (Simpa)","Université des Sciences et de la Technologie Mohamed Boudiaf Oran"]
[910,"Université_des_Sciences_et_de_la_Technologie_Mohamed_Boudiaf_Oran","Signaux, Systèmes Et Données","Université des Sciences et de la Technologie Mohamed Boudiaf Oran"]
[911,"Université_des_Sciences_et_de_la_Technologie_Mohamed_Boudiaf_Oran","Génétique Moléculaire Et Cellulaire","Université des Sciences et de la Technologie Mohamed Boudiaf Oran"]
[912,"Université_des_Sciences_et_de_la_Technologie_Mohamed_Boudiaf_Oran","Aérodynamique Navale","Université des Sciences et de la Technologie Mohamed Boudiaf Oran"]
[913,"Université_des_Sciences_et_de_la_Technologie_Mohamed_Boudiaf_Oran","Aéronautique Et Systèmes Propulsifs","Université des Sciences et de la Technologie Mohamed Boudiaf Oran"]
[914,"Université_des_Sciences_et_de_la_Technologie_Mohamed_Boudiaf_Oran","Chimie Et D'Électrochimie Des Complexes Métalliques","Université des Sciences et de la Technologie Mohamed Boudiaf Oran"]
[915,"Université_des_Sciences_et_de_la_Technologie_Mohamed_Boudiaf_Oran","Productions, Valorisations Végétales Et Microbiennes","Université des Sciences et de la Technologie Mohamed Boudiaf Oran"]
[916,"Université_des_Sciences_et_de_la_Technologie_Mohamed_Boudiaf_Oran","Sciences, Technologie Et Génie Des Procédés","Université des Sciences et de la Technologie Mohamed Boudiaf Oran"]
[917,"Université_des_Sciences_et_de_la_Technologie_Mohamed_Boudiaf_Oran","Structure De Composites Et Matériaux Innovants","Université des Sciences et de la Technologie Mohamed Boudiaf Oran"]
[918,"Université_des_Sciences_et_de_la_Technologie_Mohamed_Boudiaf_Oran","Electronique De Puissance Appliquée","Université des Sciences et de la Technologie Mohamed Boudiaf Oran"]
[919,"Université_des_Sciences_et_de_la_Technologie_Mohamed_Boudiaf_Oran","Ingénierie Des Procédés Et De L’Environnement","Université des Sciences et de la Technologie Mohamed Boudiaf Oran"]
[920,"Université_des_Sciences_et_de_la_Technologie_Mohamed_Boudiaf_Oran","Optimisation Des Réseaux Electriques","Université des Sciences et de la Technologie Mohamed Boudiaf Oran"]
[921,"Université_des_Sciences_et_de_la_Technologie_Mohamed_Boudiaf_Oran","Physique Des Matériaux Et Des Fluides","Université des Sciences et de la Technologie Mohamed Boudiaf Oran"]
[922,"Université_des_Sciences_et_de_la_Technologie_Mohamed_Boudiaf_Oran","Chimie Des Matériaux Inorganiques Et Applications","Université des Sciences et de la Technologie Mohamed Boudiaf Oran"]
[923,"Université_des_Sciences_et_de_la_Technologie_Mohamed_Boudiaf_Oran","Dèveloppement Durable De L'Energie Electrique","Université des Sciences et de la Technologie Mohamed Boudiaf Oran"]
[924,"Université_des_Sciences_et_de_la_Technologie_Mohamed_Boudiaf_Oran","Eco-Matériaux Fonctionnels Et Nanostructurés ","Université des Sciences et de la Technologie Mohamed Boudiaf Oran"]
[925,"Université_des_Sciences_et_de_la_Technologie_Mohamed_Boudiaf_Oran","Électronique De Puissance, D’Énergie Solaire Et D'Automatique","Université des Sciences et de la Technologie Mohamed Boudiaf Oran"]
[926,"Université_des_Sciences_et_de_la_Technologie_Mohamed_Boudiaf_Oran","Microsystèmes Et Systèmes Embarqués","Université des Sciences et de la Technologie Mohamed Boudiaf Oran"]
[927,"Université_des_Sciences_et_de_la_Technologie_Mohamed_Boudiaf_Oran","Synthèse Organique, Physico-Chimie, Biomolécules, Et Environnement.","Université des Sciences et de la Technologie Mohamed Boudiaf Oran"]
[928,"Université_des_Sciences_et_de_la_Technologie_Mohamed_Boudiaf_Oran","Automatisation, Vision et Contrôle Intelligent des Systèmes","Université des Sciences et de la Technologie Mohamed Boudiaf Oran"]
[929,"Université_des_Sciences_et_de_la_Technologie_Mohamed_Boudiaf_Oran","Codage et de la Sécurité de l'Information ","Université des Sciences et de la Technologie Mohamed Boudiaf Oran"]
[930,"Université_des_Sciences_et_de_la_Technologie_Mohamed_Boudiaf_Oran","L'activité physique et sportive de l'enfant et de l'adolescent","Université des Sciences et de la Technologie Mohamed Boudiaf Oran"]
[931,"Université_des_Sciences_et_de_la_Technologie_Mohamed_Boudiaf_Oran","Métropole  architecture urbanisme société ","Université des Sciences et de la Technologie Mohamed Boudiaf Oran"]
[932,"Université_des_Sciences_et_de_la_Technologie_Mohamed_Boudiaf_Oran","Sciences et ingénierie maritimes ","Université des Sciences et de la Technologie Mohamed Boudiaf Oran"]
[933,"Université_des_Sciences_Islamiques_Emir_Abdelkader_de_Constantine","Etudes Littéraires Et Humaines","Université des Sciences Islamiques Emir Abdelkader de Constantine"]
[934,"Université_des_Sciences_Islamiques_Emir_Abdelkader_de_Constantine","Etudes Prédicatives Et Communicatives","Université des Sciences Islamiques Emir Abdelkader de Constantine"]
[935,"Université_des_Sciences_Islamiques_Emir_Abdelkader_de_Constantine","Etudes Théologiques Et Comparaison Des Religions","Université des Sciences Islamiques Emir Abdelkader de Constantine"]
[936,"Université_des_Sciences_Islamiques_Emir_Abdelkader_de_Constantine","Etudes Théologiques","Université des Sciences Islamiques Emir Abdelkader de Constantine"]
[937,"Université_des_Sciences_Islamiques_Emir_Abdelkader_de_Constantine","Etudes Coraniques Et Sunna El Nabaouia","Université des Sciences Islamiques Emir Abdelkader de Constantine"]
[938,"Université_El_Djilali_Bounaama_dit_Si_Mhamed_de_Khemis_Miliana","Eau, Roche Et Plante","Université El Djilali Bounaama dit Si Mhamed de Khemis Miliana"]
[939,"Université_El_Djilali_Bounaama_dit_Si_Mhamed_de_Khemis_Miliana","Industrie, Évolution Organisationnelle Des Entreprise Et Innovation","Université El Djilali Bounaama dit Si Mhamed de Khemis Miliana"]
[940,"Université_El_Djilali_Bounaama_dit_Si_Mhamed_de_Khemis_Miliana","Energie Et Des Systèmes Intelligents","Université El Djilali Bounaama dit Si Mhamed de Khemis Miliana"]
[941,"Université_El_Djilali_Bounaama_dit_Si_Mhamed_de_Khemis_Miliana","Fluides Industriels Mesures Et Applications","Université El Djilali Bounaama dit Si Mhamed de Khemis Miliana"]
[942,"Université_El_Djilali_Bounaama_dit_Si_Mhamed_de_Khemis_Miliana","Economie Numérique En Algérie","Université El Djilali Bounaama dit Si Mhamed de Khemis Miliana"]
[943,"Université_El_Djilali_Bounaama_dit_Si_Mhamed_de_Khemis_Miliana","Organisation De L'État Civil","Université El Djilali Bounaama dit Si Mhamed de Khemis Miliana"]
[944,"Université_El_Djilali_Bounaama_dit_Si_Mhamed_de_Khemis_Miliana","Production Agricole Et Valorisation Durable De La Ressource Naturelle","Université El Djilali Bounaama dit Si Mhamed de Khemis Miliana"]
[945,"Université_El_Djilali_Bounaama_dit_Si_Mhamed_de_Khemis_Miliana","Valorisation Des Substances Naturelles","Université El Djilali Bounaama dit Si Mhamed de Khemis Miliana"]
[946,"Université_El_Djilali_Bounaama_dit_Si_Mhamed_de_Khemis_Miliana","Développement Local Et Entrepreneuriat Dans La Wilaya De Ain-Defla","Université El Djilali Bounaama dit Si Mhamed de Khemis Miliana"]
[947,"Université_El_Djilali_Bounaama_dit_Si_Mhamed_de_Khemis_Miliana","La securité nationale algérienne \"Enjeux défis \"","Université El Djilali Bounaama dit Si Mhamed de Khemis Miliana"]
[948,"Université_El_Djilali_Liabès_de_Sidi_Bel_Abbès","Biotoxicologie","Université El Djilali Liabès de Sidi Bel Abbès"]
[949,"Université_El_Djilali_Liabès_de_Sidi_Bel_Abbès","Chimie Organique Physique Et Macromoléculaire","Université El Djilali Liabès de Sidi Bel Abbès"]
[950,"Université_El_Djilali_Liabès_de_Sidi_Bel_Abbès","Critique, Études Littéraires Et Linguistique","Université El Djilali Liabès de Sidi Bel Abbès"]
[951,"Université_El_Djilali_Liabès_de_Sidi_Bel_Abbès","Eco-Développement Des Espaces","Université El Djilali Liabès de Sidi Bel Abbès"]
[952,"Université_El_Djilali_Liabès_de_Sidi_Bel_Abbès","Elaboration Et Caractérisation Des Matériaux","Université El Djilali Liabès de Sidi Bel Abbès"]
[953,"Université_El_Djilali_Liabès_de_Sidi_Bel_Abbès","Environnement Et Santé","Université El Djilali Liabès de Sidi Bel Abbès"]
[954,"Université_El_Djilali_Liabès_de_Sidi_Bel_Abbès","Intelligent Control & Electrical Power Systems","Université El Djilali Liabès de Sidi Bel Abbès"]
[955,"Université_El_Djilali_Liabès_de_Sidi_Bel_Abbès","Interaction Réseau Électrique Convertisseurs-Machines","Université El Djilali Liabès de Sidi Bel Abbès"]
[956,"Université_El_Djilali_Liabès_de_Sidi_Bel_Abbès","Matériaux Appliqués","Université El Djilali Liabès de Sidi Bel Abbès"]
[957,"Université_El_Djilali_Liabès_de_Sidi_Bel_Abbès","Matériaux Et Catalyse","Université El Djilali Liabès de Sidi Bel Abbès"]
[958,"Université_El_Djilali_Liabès_de_Sidi_Bel_Abbès","Matériaux Et Hydrologie","Université El Djilali Liabès de Sidi Bel Abbès"]
[959,"Université_El_Djilali_Liabès_de_Sidi_Bel_Abbès","Matériaux Et Systèmes Réactifs","Université El Djilali Liabès de Sidi Bel Abbès"]
[960,"Université_El_Djilali_Liabès_de_Sidi_Bel_Abbès","Mathématiques","Université El Djilali Liabès de Sidi Bel Abbès"]
[961,"Université_El_Djilali_Liabès_de_Sidi_Bel_Abbès","Micro-Électronique Appliquée","Université El Djilali Liabès de Sidi Bel Abbès"]
[962,"Université_El_Djilali_Liabès_de_Sidi_Bel_Abbès","Physique (Ou Simulation Et Modélisation En Sciences Des Matériaux)","Université El Djilali Liabès de Sidi Bel Abbès"]
[963,"Université_El_Djilali_Liabès_de_Sidi_Bel_Abbès","Synthèse De L'Information Environnementale","Université El Djilali Liabès de Sidi Bel Abbès"]
[964,"Université_El_Djilali_Liabès_de_Sidi_Bel_Abbès","Télécommunications Et Traitement Numérique Du Signal","Université El Djilali Liabès de Sidi Bel Abbès"]
[965,"Université_El_Djilali_Liabès_de_Sidi_Bel_Abbès","Evolutionary Engineering And Distributed Information Systems","Université El Djilali Liabès de Sidi Bel Abbès"]
[966,"Université_El_Djilali_Liabès_de_Sidi_Bel_Abbès","Services Publics Et Développement","Université El Djilali Liabès de Sidi Bel Abbès"]
[967,"Université_El_Djilali_Liabès_de_Sidi_Bel_Abbès","Algérie Moderne Et Contemporaine Histoire Et Société","Université El Djilali Liabès de Sidi Bel Abbès"]
[968,"Université_El_Djilali_Liabès_de_Sidi_Bel_Abbès","Etudes Orientales De Civilisation De L'Occident Musulman","Université El Djilali Liabès de Sidi Bel Abbès"]
[969,"Université_El_Djilali_Liabès_de_Sidi_Bel_Abbès","Mécanique Physique Des Matériaux","Université El Djilali Liabès de Sidi Bel Abbès"]
[970,"Université_El_Djilali_Liabès_de_Sidi_Bel_Abbès","Microscopie, Microanalyse De La Matière Et Spectroscopie Moléculaire","Université El Djilali Liabès de Sidi Bel Abbès"]
[971,"Université_El_Djilali_Liabès_de_Sidi_Bel_Abbès","Réseau De Communication, Architecture Et Multimédia","Université El Djilali Liabès de Sidi Bel Abbès"]
[972,"Université_El_Djilali_Liabès_de_Sidi_Bel_Abbès","Management Des Entreprises","Université El Djilali Liabès de Sidi Bel Abbès"]
[973,"Université_El_Djilali_Liabès_de_Sidi_Bel_Abbès","Biodiversité Végétale : Conversation Et Valorisation","Université El Djilali Liabès de Sidi Bel Abbès"]
[974,"Université_El_Djilali_Liabès_de_Sidi_Bel_Abbès","Matériaux Magnétiques","Université El Djilali Liabès de Sidi Bel Abbès"]
[975,"Université_El_Djilali_Liabès_de_Sidi_Bel_Abbès","Renouveau De La Recherche Dans La Didactique De La Langue Arabe","Université El Djilali Liabès de Sidi Bel Abbès"]
[976,"Université_El_Djilali_Liabès_de_Sidi_Bel_Abbès","Analyse Et Contrôle Des Equations Aux Dérivées Partielles","Université El Djilali Liabès de Sidi Bel Abbès"]
[977,"Université_El_Djilali_Liabès_de_Sidi_Bel_Abbès","Applications Of Plasma, Electrostatics And Electromagnetic Compatibility","Université El Djilali Liabès de Sidi Bel Abbès"]
[978,"Université_El_Djilali_Liabès_de_Sidi_Bel_Abbès","Biomathématiques","Université El Djilali Liabès de Sidi Bel Abbès"]
[979,"Université_El_Djilali_Liabès_de_Sidi_Bel_Abbès","Cancer Et Environnement","Université El Djilali Liabès de Sidi Bel Abbès"]
[980,"Université_El_Djilali_Liabès_de_Sidi_Bel_Abbès","Génie Civil Et Environnement","Université El Djilali Liabès de Sidi Bel Abbès"]
[981,"Université_El_Djilali_Liabès_de_Sidi_Bel_Abbès","Le Texte Théâtral Algérien Réassemblage Et Étude (Dans Les Dimensions Idéologiques Et Esthétiques)","Université El Djilali Liabès de Sidi Bel Abbès"]
[982,"Université_El_Djilali_Liabès_de_Sidi_Bel_Abbès","Matière Condensée Et Environnement","Université El Djilali Liabès de Sidi Bel Abbès"]
[983,"Université_El_Djilali_Liabès_de_Sidi_Bel_Abbès","Mécanique Des Structures Et Des Solides","Université El Djilali Liabès de Sidi Bel Abbès"]
[984,"Université_El_Djilali_Liabès_de_Sidi_Bel_Abbès","Pensée Islamique En Algérie","Université El Djilali Liabès de Sidi Bel Abbès"]
[985,"Université_El_Djilali_Liabès_de_Sidi_Bel_Abbès","Statistique Et Processus Stochastiques","Université El Djilali Liabès de Sidi Bel Abbès"]
[986,"Université_El_Djilali_Liabès_de_Sidi_Bel_Abbès","Management De L’Innovation Et Marketing","Université El Djilali Liabès de Sidi Bel Abbès"]
[987,"Université_El_Djilali_Liabès_de_Sidi_Bel_Abbès","Physico-Chimie Des Matériaux Avancés","Université El Djilali Liabès de Sidi Bel Abbès"]
[988,"Université_El_Djilali_Liabès_de_Sidi_Bel_Abbès","Structures Et Matériaux Avancés Dans Le Génie Civil Et Travaux Publics","Université El Djilali Liabès de Sidi Bel Abbès"]
[989,"Université_El_Djilali_Liabès_de_Sidi_Bel_Abbès","Etude Des Matériaux Et Instrumentations Optiques","Université El Djilali Liabès de Sidi Bel Abbès"]
[990,"Université_El_Djilali_Liabès_de_Sidi_Bel_Abbès","L’Activité Immobilière","Université El Djilali Liabès de Sidi Bel Abbès"]
[991,"Université_El_Djilali_Liabès_de_Sidi_Bel_Abbès","L’Algérie Et Le Bassin Occidental De La Méditerranée","Université El Djilali Liabès de Sidi Bel Abbès"]
[992,"Université_El_Djilali_Liabès_de_Sidi_Bel_Abbès","Matériaux Avancés Et Physico-Chimie Pour L'Environnement Et La Santé","Université El Djilali Liabès de Sidi Bel Abbès"]
[993,"Université_El_Djilali_Liabès_de_Sidi_Bel_Abbès","Microbiologie Moléculaire, Proteomics Et Santé","Université El Djilali Liabès de Sidi Bel Abbès"]
[994,"Université_El_Djilali_Liabès_de_Sidi_Bel_Abbès","Modélisation Et Simulation Multi Échelles","Université El Djilali Liabès de Sidi Bel Abbès"]
[995,"Université_El_Djilali_Liabès_de_Sidi_Bel_Abbès","Physique Computationnelle Des Matériaux","Université El Djilali Liabès de Sidi Bel Abbès"]
[996,"Université_El_Djilali_Liabès_de_Sidi_Bel_Abbès","Electromagnétisme photonique  et optronique","Université El Djilali Liabès de Sidi Bel Abbès"]
[997,"Université_El_Hadj_Lakhdar_de_Batna_1","Amélioration Des Productions Agricoles Et Protection Des Écosystèmes En Zones Arides","Université El Hadj Lakhdar de Batna 1"]
[998,"Université_El_Hadj_Lakhdar_de_Batna_1","Chimie Et Chimie De L'Environnement","Université El Hadj Lakhdar de Batna 1"]
[999,"Université_El_Hadj_Lakhdar_de_Batna_1","Economie D'Entreprise Et Gestion Appliquée","Université El Hadj Lakhdar de Batna 1"]
[1000,"Université_El_Hadj_Lakhdar_de_Batna_1","Etudes Économiques Maghrébines","Université El Hadj Lakhdar de Batna 1"]
[1001,"Université_El_Hadj_Lakhdar_de_Batna_1","Etudes Physico-Chimiques Des Matériaux","Université El Hadj Lakhdar de Batna 1"]
[1002,"Université_El_Hadj_Lakhdar_de_Batna_1","Patrimoine Intellectuel Et Littérature En Algérie","Université El Hadj Lakhdar de Batna 1"]
[1003,"Université_El_Hadj_Lakhdar_de_Batna_1","Etude Économique De L'Industrie Locale","Université El Hadj Lakhdar de Batna 1"]
[1004,"Université_El_Hadj_Lakhdar_de_Batna_1","Poésie","Université El Hadj Lakhdar de Batna 1"]
[1005,"Université_El_Hadj_Lakhdar_de_Batna_1","Contributions Des Maghrébins À L’Enrichissement Des Études Islamiques ","Université El Hadj Lakhdar de Batna 1"]
[1006,"Université_El_Hadj_Lakhdar_de_Batna_1","Dialogue Des Civilisations Et Mondialisation ","Université El Hadj Lakhdar de Batna 1"]
[1007,"Université_El_Hadj_Lakhdar_de_Batna_1","Encyclopédie Algérienne Facile ","Université El Hadj Lakhdar de Batna 1"]
[1008,"Université_El_Hadj_Lakhdar_de_Batna_1","Mouvement National Algérien Et Révolution De Libération 1930 - 1962 ","Université El Hadj Lakhdar de Batna 1"]
[1009,"Université_El_Hadj_Lakhdar_de_Batna_1","Physique Energétique Appliquée","Université El Hadj Lakhdar de Batna 1"]
[1010,"Université_El_Hadj_Lakhdar_de_Batna_1","Sciences Islamiques En Algérie ","Université El Hadj Lakhdar de Batna 1"]
[1011,"Université_El_Hadj_Lakhdar_de_Batna_1","Environnement, Santé Et Production Animale","Université El Hadj Lakhdar de Batna 1"]
[1012,"Université_El_Hadj_Lakhdar_de_Batna_1","Physique Des Rayonnemenets Et Leurs Interactions Avec La Matière","Université El Hadj Lakhdar de Batna 1"]
[1013,"Université_El_Hadj_Lakhdar_de_Batna_1","Développement Des Systèmes De Qualité Globale Dans Les Établissements De L`Enseignement Supérieur Et Secondaire","Université El Hadj Lakhdar de Batna 1"]
[1014,"Université_El_Hadj_Lakhdar_de_Batna_1","Psychologie De L'Usage De La Route","Université El Hadj Lakhdar de Batna 1"]
[1015,"Université_El_Hadj_Lakhdar_de_Batna_1","Chimie Des Matériaux Et Des Vivants: Activité Et Réactivité","Université El Hadj Lakhdar de Batna 1"]
[1016,"Université_El_Hadj_Lakhdar_de_Batna_1","Management-Transport-Logistique","Université El Hadj Lakhdar de Batna 1"]
[1017,"Université_El_Hadj_Lakhdar_de_Batna_1","Amélioration Des Techniques De Protection Phytosanitaires En Agro-Systèmes Montagneux: Cas Des Aurès","Université El Hadj Lakhdar de Batna 1"]
[1018,"Université_El_Hadj_Lakhdar_de_Batna_1","Sciences Des Aliments","Université El Hadj Lakhdar de Batna 1"]
[1019,"Université_El_Hadj_Lakhdar_de_Batna_1","Unité Et Diversité Des Implications De La Sécurité Dans La Région Méditerranéenne","Université El Hadj Lakhdar de Batna 1"]
[1020,"Université_El_Hadj_Lakhdar_de_Batna_1","Architecture, Urbanisme Et Transport : Habitat, Paysage Et Mobilité Urbaine","Université El Hadj Lakhdar de Batna 1"]
[1021,"Université_El_Hadj_Lakhdar_de_Batna_1","Civilizational Comprehensive Understabding Of Islam And Purposes Of Sharia","Université El Hadj Lakhdar de Batna 1"]
[1022,"Université_El_Hadj_Lakhdar_de_Batna_1","Dynamiques Sociales Dans Les Aurès","Université El Hadj Lakhdar de Batna 1"]
[1023,"Université_El_Hadj_Lakhdar_de_Batna_1","Economies D’Investissements Des Énergies Renouvelables Et Stratégies De Financement Des Zones Éloignées","Université El Hadj Lakhdar de Batna 1"]
[1024,"Université_El_Hadj_Lakhdar_de_Batna_1","Enfant, Ville Et Environnement","Université El Hadj Lakhdar de Batna 1"]
[1025,"Université_El_Hadj_Lakhdar_de_Batna_1","Etude Et Modélisation Des Phénomènes Architecturaux Et Urbains De L’Idée À L’Usage","Université El Hadj Lakhdar de Batna 1"]
[1026,"Université_El_Hadj_Lakhdar_de_Batna_1","Sécurité Humaine : Actualité , Enjeux Et Perspective","Université El Hadj Lakhdar de Batna 1"]
[1027,"Université_El_Hadj_Lakhdar_de_Batna_1","Société Et Famille","Université El Hadj Lakhdar de Batna 1"]
[1028,"Université_El_Hadj_Lakhdar_de_Batna_1","Algérie : Histoire Culture Et Société","Université El Hadj Lakhdar de Batna 1"]
[1029,"Université_El_Hadj_Lakhdar_de_Batna_1","Applications Psychologique Dans Le Milieu Carcéral","Université El Hadj Lakhdar de Batna 1"]
[1030,"Université_El_Hadj_Lakhdar_de_Batna_1","Banque Des Tests Psychologiques, Scolaires Et Professionnels.","Université El Hadj Lakhdar de Batna 1"]
[1031,"Université_El_Hadj_Lakhdar_de_Batna_1","Etude Socio-Économique De La Vie Quotidienne","Université El Hadj Lakhdar de Batna 1"]
[1032,"Université_El_Hadj_Lakhdar_de_Batna_1","Imaginaire Oral Entre La Civilisation De L’Oralité D’Un Côté, Et Les Civilisations De L’Écriture Et De L’Image De L’Autre.","Université El Hadj Lakhdar de Batna 1"]
[1033,"Université_Ferhat_Abbes_de_Sétif_1","Amélioration Et Développement De La Production Végétale Et Animale","Université Ferhat Abbes de Sétif 1"]
[1034,"Université_Ferhat_Abbes_de_Sétif_1","Architecture Et Urbanisme (Architecture Méditerranéenne)","Université Ferhat Abbes de Sétif 1"]
[1035,"Université_Ferhat_Abbes_de_Sétif_1","Biochimie Appliquée : Inflammation Et Activités Pharmaco-Biologiques Des Substances Naturelles","Université Ferhat Abbes de Sétif 1"]
[1036,"Université_Ferhat_Abbes_de_Sétif_1","Dosage Analyse Et Caractérisation En Haute Résolution","Université Ferhat Abbes de Sétif 1"]
[1037,"Université_Ferhat_Abbes_de_Sétif_1","Elaboration Des Nouveaux Matériaux Et Leur Caractérisation","Université Ferhat Abbes de Sétif 1"]
[1038,"Université_Ferhat_Abbes_de_Sétif_1","Electrochimie Des Matériaux Moléculaires Et Complexes","Université Ferhat Abbes de Sétif 1"]
[1039,"Université_Ferhat_Abbes_de_Sétif_1","Energétique Et Électrochimie Du Solide","Université Ferhat Abbes de Sétif 1"]
[1040,"Université_Ferhat_Abbes_de_Sétif_1","Génie Des Procédés Chimiques","Université Ferhat Abbes de Sétif 1"]
[1041,"Université_Ferhat_Abbes_de_Sétif_1","Instrumentation Scientifique","Université Ferhat Abbes de Sétif 1"]
[1042,"Université_Ferhat_Abbes_de_Sétif_1","Mathématiques Appliquées","Université Ferhat Abbes de Sétif 1"]
[1043,"Université_Ferhat_Abbes_de_Sétif_1","Mathématiques Fondamentales Et Numériques","Université Ferhat Abbes de Sétif 1"]
[1044,"Université_Ferhat_Abbes_de_Sétif_1","Microbiologie Appliquée","Université Ferhat Abbes de Sétif 1"]
[1045,"Université_Ferhat_Abbes_de_Sétif_1","Optoélectronique Et Composants","Université Ferhat Abbes de Sétif 1"]
[1046,"Université_Ferhat_Abbes_de_Sétif_1","Physico-Chimie Des Hauts Polymères","Université Ferhat Abbes de Sétif 1"]
[1047,"Université_Ferhat_Abbes_de_Sétif_1","Phytothérapie Appliquée Aux Maladies Chroniques","Université Ferhat Abbes de Sétif 1"]
[1048,"Université_Ferhat_Abbes_de_Sétif_1","Préparations, Modifications Et Applications Des Matériaux Polymériques Multiphasiques","Université Ferhat Abbes de Sétif 1"]
[1049,"Université_Ferhat_Abbes_de_Sétif_1","Projet Urbain, Ville Et Territoire","Université Ferhat Abbes de Sétif 1"]
[1050,"Université_Ferhat_Abbes_de_Sétif_1","Santé Et Environnement Dans Les Hauts Plateaux Sétifiens","Université Ferhat Abbes de Sétif 1"]
[1051,"Université_Ferhat_Abbes_de_Sétif_1","Systèmes Intelligents","Université Ferhat Abbes de Sétif 1"]
[1052,"Université_Ferhat_Abbes_de_Sétif_1","Valorisation Des Ressources Biologiques Naturelles","Université Ferhat Abbes de Sétif 1"]
[1053,"Université_Ferhat_Abbes_de_Sétif_1","Automatique","Université Ferhat Abbes de Sétif 1"]
[1054,"Université_Ferhat_Abbes_de_Sétif_1","Croissance Et Caractérisation De Nouveaux Semi-Conducteurs","Université Ferhat Abbes de Sétif 1"]
[1055,"Université_Ferhat_Abbes_de_Sétif_1","Etudes Des Surfaces Et Interfaces Des Matériaux Solides","Université Ferhat Abbes de Sétif 1"]
[1056,"Université_Ferhat_Abbes_de_Sétif_1","Matériaux Non Métalliques","Université Ferhat Abbes de Sétif 1"]
[1057,"Université_Ferhat_Abbes_de_Sétif_1","Mécanique De Précision Appliquée","Université Ferhat Abbes de Sétif 1"]
[1058,"Université_Ferhat_Abbes_de_Sétif_1","Optique Appliquée","Université Ferhat Abbes de Sétif 1"]
[1059,"Université_Ferhat_Abbes_de_Sétif_1","Physique Et Mécanique Des Matériaux Métalliques","Université Ferhat Abbes de Sétif 1"]
[1060,"Université_Ferhat_Abbes_de_Sétif_1","Physique Quantique Et Systèmes Dynamiques","Université Ferhat Abbes de Sétif 1"]
[1061,"Université_Ferhat_Abbes_de_Sétif_1","Qualité De L'Énergie Dans Les Réseaux Électriques","Université Ferhat Abbes de Sétif 1"]
[1062,"Université_Ferhat_Abbes_de_Sétif_1","Système Photonique Et Optique Non Linéaire","Université Ferhat Abbes de Sétif 1"]
[1063,"Université_Ferhat_Abbes_de_Sétif_1","Electrochimie, Ingénierie Moléculaire Et Catalyses Redox","Université Ferhat Abbes de Sétif 1"]
[1064,"Université_Ferhat_Abbes_de_Sétif_1","Electronique De Puissance Et Commande Industrielle","Université Ferhat Abbes de Sétif 1"]
[1065,"Université_Ferhat_Abbes_de_Sétif_1","Partenariat Et Investissement Dans Les Petites Et Moyennes Entreprises Euro-Maghreb – Etude Économique Et Juridique","Université Ferhat Abbes de Sétif 1"]
[1066,"Université_Ferhat_Abbes_de_Sétif_1","Chimie Ingénierie Moléculaire Et Nanostructures","Université Ferhat Abbes de Sétif 1"]
[1067,"Université_Ferhat_Abbes_de_Sétif_1","Electrochimie Et Matériaux","Université Ferhat Abbes de Sétif 1"]
[1068,"Université_Ferhat_Abbes_de_Sétif_1","Evaluation Des Marchés Des Capitaux Algériens Dans La Perspective De Leur Développement Dans Le Cadre De La Globalisation","Université Ferhat Abbes de Sétif 1"]
[1069,"Université_Ferhat_Abbes_de_Sétif_1","Habitat Et Environnement","Université Ferhat Abbes de Sétif 1"]
[1070,"Université_Ferhat_Abbes_de_Sétif_1","Réseaux & Systèmes Distribués","Université Ferhat Abbes de Sétif 1"]
[1071,"Université_Ferhat_Abbes_de_Sétif_1","Unité De Recherche : Matériaux Émergents","Université Ferhat Abbes de Sétif 1"]
[1072,"Université_Ferhat_Abbes_de_Sétif_1","Maladies Cardiovasculaires Génétiques Et Nutritionnelles","Université Ferhat Abbes de Sétif 1"]
[1073,"Université_Frères_Mentouri_de_Constantine_1","Aménagement Du Territoire","Université Frères Mentouri de Constantine 1"]
[1074,"Université_Frères_Mentouri_de_Constantine_1","Biochimie Génétique Et Biotechnologie Végétale","Université Frères Mentouri de Constantine 1"]
[1075,"Université_Frères_Mentouri_de_Constantine_1","Céramiques","Université Frères Mentouri de Constantine 1"]
[1076,"Université_Frères_Mentouri_de_Constantine_1","Couche Mince Et Interfaces","Université Frères Mentouri de Constantine 1"]
[1077,"Université_Frères_Mentouri_de_Constantine_1","Cristallographie","Université Frères Mentouri de Constantine 1"]
[1078,"Université_Frères_Mentouri_de_Constantine_1","Développement Et Valorisation Des Ressources Phytogénétiques","Université Frères Mentouri de Constantine 1"]
[1079,"Université_Frères_Mentouri_de_Constantine_1","Droit Et Dynamique Sociale","Université Frères Mentouri de Constantine 1"]
[1080,"Université_Frères_Mentouri_de_Constantine_1","Electrotechnique De Constantine","Université Frères Mentouri de Constantine 1"]
[1081,"Université_Frères_Mentouri_de_Constantine_1","Equations Différentielles","Université Frères Mentouri de Constantine 1"]
[1082,"Université_Frères_Mentouri_de_Constantine_1","Génie Climatique De Constantine","Université Frères Mentouri de Constantine 1"]
[1083,"Université_Frères_Mentouri_de_Constantine_1","Génie Microbiologie Et Applications","Université Frères Mentouri de Constantine 1"]
[1084,"Université_Frères_Mentouri_de_Constantine_1","Matériaux Et Durabilité Des Constructions","Université Frères Mentouri de Constantine 1"]
[1085,"Université_Frères_Mentouri_de_Constantine_1","Mécanique","Université Frères Mentouri de Constantine 1"]
[1086,"Université_Frères_Mentouri_de_Constantine_1","Mécanique Des Sols Et Des Structures","Université Frères Mentouri de Constantine 1"]
[1087,"Université_Frères_Mentouri_de_Constantine_1","Microstructure Et Défauts Dans Les Matériaux","Université Frères Mentouri de Constantine 1"]
[1088,"Université_Frères_Mentouri_de_Constantine_1","Microsystèmes Et Instrumentation","Université Frères Mentouri de Constantine 1"]
[1089,"Université_Frères_Mentouri_de_Constantine_1","Nutrition Et Technologie Alimentaire","Université Frères Mentouri de Constantine 1"]
[1090,"Université_Frères_Mentouri_de_Constantine_1","Pathologie Animale, Développement Des Élevages Et Surveillance De La Chaîne Alimentaire Des Denrées Animales","Université Frères Mentouri de Constantine 1"]
[1091,"Université_Frères_Mentouri_de_Constantine_1","Physique Mathematique Et De Physique Subatomique","Université Frères Mentouri de Constantine 1"]
[1092,"Université_Frères_Mentouri_de_Constantine_1","Physique-Chimie Des Semi-Conducteurs","Université Frères Mentouri de Constantine 1"]
[1093,"Université_Frères_Mentouri_de_Constantine_1","Pollution Et Traitement Des Eaux","Université Frères Mentouri de Constantine 1"]
[1094,"Université_Frères_Mentouri_de_Constantine_1","Produits Naturels D'Origine Végitale Et De Synthèse Organique","Université Frères Mentouri de Constantine 1"]
[1095,"Université_Frères_Mentouri_de_Constantine_1","Science Du Langage, Discours Et Didactique","Université Frères Mentouri de Constantine 1"]
[1096,"Université_Frères_Mentouri_de_Constantine_1","Sciences Et Technologies De L'Enevironnement","Université Frères Mentouri de Constantine 1"]
[1097,"Université_Frères_Mentouri_de_Constantine_1","Traitement Du Signal","Université Frères Mentouri de Constantine 1"]
[1098,"Université_Frères_Mentouri_de_Constantine_1","Biologie Et Environnement","Université Frères Mentouri de Constantine 1"]
[1099,"Université_Frères_Mentouri_de_Constantine_1","Electromagnetisme Et Télecomminication","Université Frères Mentouri de Constantine 1"]
[1100,"Université_Frères_Mentouri_de_Constantine_1","Etude Et Recherche Sur Le Maghreb Et La Méditerranée","Université Frères Mentouri de Constantine 1"]
[1101,"Université_Frères_Mentouri_de_Constantine_1","Etude Sur Le Patrimoine","Université Frères Mentouri de Constantine 1"]
[1102,"Université_Frères_Mentouri_de_Constantine_1","Etudes Du Language","Université Frères Mentouri de Constantine 1"]
[1103,"Université_Frères_Mentouri_de_Constantine_1","Hyperfréquence Et Semi-Conducteurs","Université Frères Mentouri de Constantine 1"]
[1104,"Université_Frères_Mentouri_de_Constantine_1","Langues Et Traduction","Université Frères Mentouri de Constantine 1"]
[1105,"Université_Frères_Mentouri_de_Constantine_1","Modilisation Mathématique Et Simulation","Université Frères Mentouri de Constantine 1"]
[1106,"Université_Frères_Mentouri_de_Constantine_1","Narrative Arabe","Université Frères Mentouri de Constantine 1"]
[1107,"Université_Frères_Mentouri_de_Constantine_1","Pathologie Des Animaux Et Gestion De La Reproduction","Université Frères Mentouri de Constantine 1"]
[1108,"Université_Frères_Mentouri_de_Constantine_1","Pharmacologie Et Toxicologie","Université Frères Mentouri de Constantine 1"]
[1109,"Université_Frères_Mentouri_de_Constantine_1","Physique Énergétique","Université Frères Mentouri de Constantine 1"]
[1110,"Université_Frères_Mentouri_de_Constantine_1","Traduction","Université Frères Mentouri de Constantine 1"]
[1111,"Université_Frères_Mentouri_de_Constantine_1","Etude Des Matériaux Electroniques Pour Applications Médicales","Université Frères Mentouri de Constantine 1"]
[1112,"Université_Frères_Mentouri_de_Constantine_1","Geologie Et Environnement","Université Frères Mentouri de Constantine 1"]
[1113,"Université_Frères_Mentouri_de_Constantine_1","Méthodologie Mathématiques Etudes Et Resolustion D'Équations","Université Frères Mentouri de Constantine 1"]
[1114,"Université_Frères_Mentouri_de_Constantine_1","Obtention De Substances Thérapeutiques","Université Frères Mentouri de Constantine 1"]
[1115,"Université_Frères_Mentouri_de_Constantine_1","Physique Théorique","Université Frères Mentouri de Constantine 1"]
[1116,"Université_Frères_Mentouri_de_Constantine_1","Thermodynamique Et Traitement De Surfaces Des Matériaux","Université Frères Mentouri de Constantine 1"]
[1117,"Université_Frères_Mentouri_de_Constantine_1","Automatique Et Robotique","Université Frères Mentouri de Constantine 1"]
[1118,"Université_Frères_Mentouri_de_Constantine_1","Biosystematique Et Ecologie Des Arthropodes","Université Frères Mentouri de Constantine 1"]
[1119,"Université_Frères_Mentouri_de_Constantine_1","Energétique Appliquée Et De Pollution","Université Frères Mentouri de Constantine 1"]
[1120,"Université_Frères_Mentouri_de_Constantine_1","Mathematiques Apliquées Et Modelisation","Université Frères Mentouri de Constantine 1"]
[1121,"Université_Frères_Mentouri_de_Constantine_1","Signaux Et Systèmes De Communication","Université Frères Mentouri de Constantine 1"]
[1122,"Université_Frères_Mentouri_de_Constantine_1","Biologie Moléculaire Et Cellulaire","Université Frères Mentouri de Constantine 1"]
[1123,"Université_Frères_Mentouri_de_Constantine_1","Mathématiques Et Sciences De La Décision","Université Frères Mentouri de Constantine 1"]
[1124,"Université_Frères_Mentouri_de_Constantine_1","Réhabilitation Des Écosystèmes Et Développement Durable","Université Frères Mentouri de Constantine 1"]
[1125,"Université_Frères_Mentouri_de_Constantine_1","Unité De Recherche: Chimie De L'Environnement Et Moléculaire Structurale (Remplace Le Lr 2000 \"Chimie Moléculaire Et Contrôle De L'Environnement Et Mesures Physico-Chimiques\")","Université Frères Mentouri de Constantine 1"]
[1126,"Université_Frères_Mentouri_de_Constantine_1","Gestion De La Santé Et Productions Animales","Université Frères Mentouri de Constantine 1"]
[1127,"Université_Frères_Mentouri_de_Constantine_1","Ingénierie Des Transports Et Environnement","Université Frères Mentouri de Constantine 1"]
[1128,"Université_Frères_Mentouri_de_Constantine_1","Modelisation Des Dispositifs À Energie Renouvelable Et Nanometriques","Université Frères Mentouri de Constantine 1"]
[1129,"Université_Frères_Mentouri_de_Constantine_1","Sciences Du Territoire, Ressources Naturelles Et Environnement","Université Frères Mentouri de Constantine 1"]
[1130,"Université_Frères_Mentouri_de_Constantine_1","Techniques Innovantes De Préservation De L'Environnement","Université Frères Mentouri de Constantine 1"]
[1131,"Université_Frères_Mentouri_de_Constantine_1","Chimie Des Matériaux Constantine","Université Frères Mentouri de Constantine 1"]
[1132,"Université_Frères_Mentouri_de_Constantine_1","Encyclopédie De La Littérature Algérienne","Université Frères Mentouri de Constantine 1"]
[1133,"Université_Frères_Mentouri_de_Constantine_1","Energies Renouvelables Et Développement Durable","Université Frères Mentouri de Constantine 1"]
[1134,"Université_Frères_Mentouri_de_Constantine_1","Ethnobotany-Palynology And Ethnopharmacology- Toxicology.","Université Frères Mentouri de Constantine 1"]
[1135,"Université_Frères_Mentouri_de_Constantine_1","Génie Electrique De Constantine","Université Frères Mentouri de Constantine 1"]
[1136,"Université_Frères_Mentouri_de_Constantine_1","Mycologie, De Biotechnologies Et De L’Activité Microbienne","Université Frères Mentouri de Constantine 1"]
[1137,"Université_Frères_Mentouri_de_Constantine_1","Physicochimie Analytique Et Cristallochimie De Matériaux Organométalliques Et Biomoléculaires","Université Frères Mentouri de Constantine 1"]
[1138,"Université_Frères_Mentouri_de_Constantine_1","Synthèse De Molécules D’Intérêts Biologiques","Université Frères Mentouri de Constantine 1"]
[1139,"Université_Frères_Mentouri_de_Constantine_1","Unité De Recherche : Sciences Des Matériaux Et Applications (Remplace Lr2000 Transformations De Phases)","Université Frères Mentouri de Constantine 1"]
[1140,"Université_Frères_Mentouri_de_Constantine_1","Unité De Recherche : Valorisation Des Ressources Naturelles, Molécules Bioactives Et Analyses Physico-Chimiques Et Biologiques (Fusion: Lr2000 Valorisation Des Ressources Naturelles + Lr2002 Phytochimie Et Analyses)","Université Frères Mentouri de Constantine 1"]
[1141,"Université_Frères_Mentouri_de_Constantine_1","Biotechnologie Et Qualité Des Aliments","Université Frères Mentouri de Constantine 1"]
[1142,"Université_Frères_Mentouri_de_Constantine_1","Des contrats et droit des affaires   ","Université Frères Mentouri de Constantine 1"]
[1143,"Université_Hassiba_Ben_Bouali_de_Chlef","Développement, Conditionnement, Stockage Et Transformation Des Céréales: Cas Du Blé","Université Hassiba Ben Bouali de Chlef"]
[1144,"Université_Hassiba_Ben_Bouali_de_Chlef","Sciences Des Matériaux Et Environnement","Université Hassiba Ben Bouali de Chlef"]
[1145,"Université_Hassiba_Ben_Bouali_de_Chlef","Eau Et Environnement","Université Hassiba Ben Bouali de Chlef"]
[1146,"Université_Hassiba_Ben_Bouali_de_Chlef","Mondialisation Et Ses Retombées Sur Les Économies Des Pays Nord-Africains Et Études De La Possibilité De Construire Une Union Nord-Africaine","Université Hassiba Ben Bouali de Chlef"]
[1147,"Université_Hassiba_Ben_Bouali_de_Chlef","Physique Théorique Et De Physique Des Matériaux","Université Hassiba Ben Bouali de Chlef"]
[1148,"Université_Hassiba_Ben_Bouali_de_Chlef","Bioressources Naturelles Locales","Université Hassiba Ben Bouali de Chlef"]
[1149,"Université_Hassiba_Ben_Bouali_de_Chlef","Systèmes Financiers Et Bancaires Et Les Politiques Macro-Économique Face Aux Fluctuations Internationales","Université Hassiba Ben Bouali de Chlef"]
[1150,"Université_Hassiba_Ben_Bouali_de_Chlef","Théorie De La Langue Fonctionnelle","Université Hassiba Ben Bouali de Chlef"]
[1151,"Université_Hassiba_Ben_Bouali_de_Chlef","Chimie Végétale – Eau – Énergie","Université Hassiba Ben Bouali de Chlef"]
[1152,"Université_Hassiba_Ben_Bouali_de_Chlef","Génie Électrique Et Énergies Renouvelables","Université Hassiba Ben Bouali de Chlef"]
[1153,"Université_Hassiba_Ben_Bouali_de_Chlef","Géomatériaux","Université Hassiba Ben Bouali de Chlef"]
[1154,"Université_Hassiba_Ben_Bouali_de_Chlef","Mécanique Et Energétique","Université Hassiba Ben Bouali de Chlef"]
[1155,"Université_Hassiba_Ben_Bouali_de_Chlef","Rhéologie Et Mécanique","Université Hassiba Ben Bouali de Chlef"]
[1156,"Université_Hassiba_Ben_Bouali_de_Chlef","Développement De La Compétitivité Des Pme Algérienne Dans Les Industries Locales De Substitution","Université Hassiba Ben Bouali de Chlef"]
[1157,"Université_Hassiba_Ben_Bouali_de_Chlef","Innovation, Performance Motrice","Université Hassiba Ben Bouali de Chlef"]
[1158,"Université_Hassiba_Ben_Bouali_de_Chlef","Réforme Des Politiques Arabe Sous Contraintes De La Mondialisation","Université Hassiba Ben Bouali de Chlef"]
[1159,"Université_Hassiba_Ben_Bouali_de_Chlef","Aps, Société, Éducation Et Santé","Université Hassiba Ben Bouali de Chlef"]
[1160,"Université_Hassiba_Ben_Bouali_de_Chlef","Biologie Moléculaire, Génomique Et Bioinformatique","Université Hassiba Ben Bouali de Chlef"]
[1161,"Université_Hassiba_Ben_Bouali_de_Chlef","Contrôle, Essai, Mesure Et Simulation Mécanique","Université Hassiba Ben Bouali de Chlef"]
[1162,"Université_Hassiba_Ben_Bouali_de_Chlef","Didactique Des Langues Et Analyse Du Discours","Université Hassiba Ben Bouali de Chlef"]
[1163,"Université_Hassiba_Ben_Bouali_de_Chlef","Droit Et Sécurité Humanitaire","Université Hassiba Ben Bouali de Chlef"]
[1164,"Université_Hassiba_Ben_Bouali_de_Chlef","Droit Privé Comparé","Université Hassiba Ben Bouali de Chlef"]
[1165,"Université_Hassiba_Ben_Bouali_de_Chlef","Mathématiques Et Applications","Université Hassiba Ben Bouali de Chlef"]
[1166,"Université_Hassiba_Ben_Bouali_de_Chlef","Société, Problèmes Du Développement Local En Algérie","Université Hassiba Ben Bouali de Chlef"]
[1167,"Université_Hassiba_Ben_Bouali_de_Chlef","Structures, Géotechnique Et Risques","Université Hassiba Ben Bouali de Chlef"]
[1168,"Université_Hassiba_Ben_Bouali_de_Chlef","Technologie de l'information et de la communication dans l'enseignement des langues étrangères ","Université Hassiba Ben Bouali de Chlef"]
[1169,"Université_Ibn_Khaldoun_de_Tiaret","Agro-Biotechnologie Et Nutrition En Zones Semi-Arides","Université Ibn Khaldoun de Tiaret"]
[1170,"Université_Ibn_Khaldoun_de_Tiaret","Génie Physique","Université Ibn Khaldoun de Tiaret"]
[1171,"Université_Ibn_Khaldoun_de_Tiaret","Synthèse Et Catalyse","Université Ibn Khaldoun de Tiaret"]
[1172,"Université_Ibn_Khaldoun_de_Tiaret","Technologies Industrielles","Université Ibn Khaldoun de Tiaret"]
[1173,"Université_Ibn_Khaldoun_de_Tiaret","Etude Grammaticale Et Langagiére Entre Tradition Et Modérnité En Algérie","Université Ibn Khaldoun de Tiaret"]
[1174,"Université_Ibn_Khaldoun_de_Tiaret","Législation De Protection Du Système D'Environnement","Université Ibn Khaldoun de Tiaret"]
[1175,"Université_Ibn_Khaldoun_de_Tiaret","Génie Électrique Et Des Plasmas","Université Ibn Khaldoun de Tiaret"]
[1176,"Université_Ibn_Khaldoun_de_Tiaret","Hygiène Et De Pathologie Animale","Université Ibn Khaldoun de Tiaret"]
[1177,"Université_Ibn_Khaldoun_de_Tiaret","Amélioration Et Valorisation Des Productions Animales Locales","Université Ibn Khaldoun de Tiaret"]
[1178,"Université_Ibn_Khaldoun_de_Tiaret","Discours Argumentatif Ses Origines , Ses Références Et Ses Perspectives En Algérie","Université Ibn Khaldoun de Tiaret"]
[1179,"Université_Ibn_Khaldoun_de_Tiaret","Génie Energétique Et Génie Informatique","Université Ibn Khaldoun de Tiaret"]
[1180,"Université_Ibn_Khaldoun_de_Tiaret","Informatique Et Mathématiques","Université Ibn Khaldoun de Tiaret"]
[1181,"Université_Ibn_Khaldoun_de_Tiaret","Reproduction Des Animaux De Le Ferme","Université Ibn Khaldoun de Tiaret"]
[1182,"Université_Ibn_Khaldoun_de_Tiaret","Physiologie Végétale Appliquée Aux Cultures Hors Sol","Université Ibn Khaldoun de Tiaret"]
[1183,"Université_Ibn_Khaldoun_de_Tiaret","Etudes historiques et archéologiques de l’Afrique du nord  ","Université Ibn Khaldoun de Tiaret"]
[1184,"Université_Ibn_Khaldoun_de_Tiaret","Géomatique et développement durable","Université Ibn Khaldoun de Tiaret"]
[1185,"Université_Kasdi_Merbah_de_Ouargla","Développement Des Énergies Nouvelles Et Renouvelables Dans Les Zones Arides Et Sahariennes","Université Kasdi Merbah de Ouargla"]
[1186,"Université_Kasdi_Merbah_de_Ouargla","Protection Des Écosystèmes En Zones Arides Et Semi-Arides","Université Kasdi Merbah de Ouargla"]
[1187,"Université_Kasdi_Merbah_de_Ouargla","Valorisation Et Promotion Des Ressources Sahariennes","Université Kasdi Merbah de Ouargla"]
[1188,"Université_Kasdi_Merbah_de_Ouargla","Exploitation Et Valorisation Des Ressources Naturelles En Zones Arides","Université Kasdi Merbah de Ouargla"]
[1189,"Université_Kasdi_Merbah_de_Ouargla","Bioressources Sahariennes Préservation Et Valorisation","Université Kasdi Merbah de Ouargla"]
[1190,"Université_Kasdi_Merbah_de_Ouargla","Pratiques Psychologiques Éducatives Dans L'Enseignement","Université Kasdi Merbah de Ouargla"]
[1191,"Université_Kasdi_Merbah_de_Ouargla","Role De L'Université Et Les Entreprises Économiques Dans Le Développement Locale Durable","Université Kasdi Merbah de Ouargla"]
[1192,"Université_Kasdi_Merbah_de_Ouargla","Biogéochimie Des Milieux Désertiques","Université Kasdi Merbah de Ouargla"]
[1193,"Université_Kasdi_Merbah_de_Ouargla","Critique Et Sa Terminologie","Université Kasdi Merbah de Ouargla"]
[1194,"Université_Kasdi_Merbah_de_Ouargla","Economie Des Organisations Et L'Environnement Naturel Econature","Université Kasdi Merbah de Ouargla"]
[1195,"Université_Kasdi_Merbah_de_Ouargla","Financement, Finance Des Marchés Et Finance D'Entreprise","Université Kasdi Merbah de Ouargla"]
[1196,"Université_Kasdi_Merbah_de_Ouargla","Génie Des Procédés","Université Kasdi Merbah de Ouargla"]
[1197,"Université_Kasdi_Merbah_de_Ouargla","Patrimoine Linguistique Et Littéraire Dans Le Sud-Est Algérien","Université Kasdi Merbah de Ouargla"]
[1198,"Université_Kasdi_Merbah_de_Ouargla","Performance Des Entreprises Et Des Économies Dans Le Cadre De La Mondialisation","Université Kasdi Merbah de Ouargla"]
[1199,"Université_Kasdi_Merbah_de_Ouargla","Transition Politico-Economique Et Social Dont Le Cas De L'Algérie","Université Kasdi Merbah de Ouargla"]
[1200,"Université_Kasdi_Merbah_de_Ouargla","Géologie De Sahara","Université Kasdi Merbah de Ouargla"]
[1201,"Université_Kasdi_Merbah_de_Ouargla","Mathématiques Appliqués","Université Kasdi Merbah de Ouargla"]
[1202,"Université_Kasdi_Merbah_de_Ouargla","Psychologie Et Qualité De Vie","Université Kasdi Merbah de Ouargla"]
[1203,"Université_Kasdi_Merbah_de_Ouargla","Rayonnement Et Plasmas, Physique De Surface","Université Kasdi Merbah de Ouargla"]
[1204,"Université_Kasdi_Merbah_de_Ouargla","Transformation Des Construits Sociaux Et Son Impact Sur L'Identité Et L'Action Sociale Dans Les Sociétés En Transition","Université Kasdi Merbah de Ouargla"]
[1205,"Université_Kasdi_Merbah_de_Ouargla","Dynamique, Interaction Et Reactivité Des Systèmes","Université Kasdi Merbah de Ouargla"]
[1206,"Université_Kasdi_Merbah_de_Ouargla","Exigences Pour La Réhabilitation Et Le Développement Des Économies En Développement Dans L'Ouverture De L'Économie Mondial","Université Kasdi Merbah de Ouargla"]
[1207,"Université_Kasdi_Merbah_de_Ouargla","Français Des Écrits Universitaires","Université Kasdi Merbah de Ouargla"]
[1208,"Université_Kasdi_Merbah_de_Ouargla","Génie De L’Eau Et De L’Environnement En Milieu Saharien","Université Kasdi Merbah de Ouargla"]
[1209,"Université_Kasdi_Merbah_de_Ouargla","Génie Electrique","Université Kasdi Merbah de Ouargla"]
[1210,"Université_Kasdi_Merbah_de_Ouargla","Linguistique Textuelle Et L’Analyse De Discours","Université Kasdi Merbah de Ouargla"]
[1211,"Université_Kasdi_Merbah_de_Ouargla","Applications Quantitatives En Sciences Economiques Et Financières","Université Kasdi Merbah de Ouargla"]
[1212,"Université_Kasdi_Merbah_de_Ouargla","La Phœniciculture","Université Kasdi Merbah de Ouargla"]
[1213,"Université_Kasdi_Merbah_de_Ouargla","Qualité Des Programmes En Education Spécialisée Et L'Enseignement Adapté","Université Kasdi Merbah de Ouargla"]
[1214,"Université_Kasdi_Merbah_de_Ouargla","Science Et Technologie Des Activités Physiques Et Sportives","Université Kasdi Merbah de Ouargla"]
[1215,"Université_Kasdi_Merbah_de_Ouargla","Les Réservoirs Souterrains Pétroliers, Gaziers Et Aquifères","Université Kasdi Merbah de Ouargla"]
[1216,"Université_Kasdi_Merbah_de_Ouargla","English language ,literature","Université Kasdi Merbah de Ouargla"]
[1217,"Université_Kasdi_Merbah_de_Ouargla","Inteligence artificiele des technologies de l'information","Université Kasdi Merbah de Ouargla"]
[1218,"Université_Kasdi_Merbah_de_Ouargla","La Neuropsychologie et Troubles: Cognitives et Socio-affectives.","Université Kasdi Merbah de Ouargla"]
[1219,"Université_Lamine_Debaghine_de_Sétif_2","Etudes Et Recherches Sur Les Droits De L'Homme","Université Lamine Debaghine de Sétif 2"]
[1220,"Université_Lamine_Debaghine_de_Sétif_2","Dictionnaire Des Termes Linguistiques Et Rhétorique Dans L'Héritage Arabe Jusqu'À La Fin Du 7 E Siècle H","Université Lamine Debaghine de Sétif 2"]
[1221,"Université_Lamine_Debaghine_de_Sétif_2","Psychologie Clinique","Université Lamine Debaghine de Sétif 2"]
[1222,"Université_Lamine_Debaghine_de_Sétif_2","Méthodes Critiques Contemporaines Et Analyse Du Discours","Université Lamine Debaghine de Sétif 2"]
[1223,"Université_Lamine_Debaghine_de_Sétif_2","La Société Algérienne Contemporaine","Université Lamine Debaghine de Sétif 2"]
[1224,"Université_Lamine_Debaghine_de_Sétif_2","Unité De Recherche Dèveloppement Des Ressources Humaines","Université Lamine Debaghine de Sétif 2"]
[1225,"Université_Lamine_Debaghine_de_Sétif_2","Acculturation Arabe Dans La Littérature Et La Critique","Université Lamine Debaghine de Sétif 2"]
[1226,"Université_Lamine_Debaghine_de_Sétif_2","Esthétiques Dans Les Tues Littéraires Et Critiques","Université Lamine Debaghine de Sétif 2"]
[1227,"Université_Lamine_Debaghine_de_Sétif_2","Approche pragmatique et stratégies du discours.","Université Lamine Debaghine de Sétif 2"]
[1228,"Université_Lamine_Debaghine_de_Sétif_2","Etudes et recherches sur massacres coloniaux","Université Lamine Debaghine de Sétif 2"]
[1229,"Université_Lamine_Debaghine_de_Sétif_2","Narratologie et systèmes culturels","Université Lamine Debaghine de Sétif 2"]
[1230,"Université_Lamine_Debaghine_de_Sétif_2","Patrimoine et Etudes Archéologiques","Université Lamine Debaghine de Sétif 2"]
[1231,"Université_Larbi_Ben_Mhidi_de_Oum_El_Bouaghi","Chimie Appliquée Et Technologie Des Matériaux","Université Larbi Ben Mhidi de Oum El Bouaghi"]
[1232,"Université_Larbi_Ben_Mhidi_de_Oum_El_Bouaghi","Matériaux Et Structures Des Systèmes Electromécaniques Et Leurs Fiabilités","Université Larbi Ben Mhidi de Oum El Bouaghi"]
[1233,"Université_Larbi_Ben_Mhidi_de_Oum_El_Bouaghi","Ressources Naturelles Et Aménagement Des Milieux Sensibles","Université Larbi Ben Mhidi de Oum El Bouaghi"]
[1234,"Université_Larbi_Ben_Mhidi_de_Oum_El_Bouaghi","Système Dynamique Et Contrôle","Université Larbi Ben Mhidi de Oum El Bouaghi"]
[1235,"Université_Larbi_Ben_Mhidi_de_Oum_El_Bouaghi","Biomolécules Végétales Et Amélioration Des Plantes","Université Larbi Ben Mhidi de Oum El Bouaghi"]
[1236,"Université_Larbi_Ben_Mhidi_de_Oum_El_Bouaghi","Composants Actifs Et Matériaux","Université Larbi Ben Mhidi de Oum El Bouaghi"]
[1237,"Université_Larbi_Ben_Mhidi_de_Oum_El_Bouaghi","Comptabilité, Finance, Fiscalité Et Assurance","Université Larbi Ben Mhidi de Oum El Bouaghi"]
[1238,"Université_Larbi_Ben_Mhidi_de_Oum_El_Bouaghi","Société Et Développement Juridique Et Politique","Université Larbi Ben Mhidi de Oum El Bouaghi"]
[1239,"Université_Larbi_Ben_Mhidi_de_Oum_El_Bouaghi","Research Laboratory On Computer Science’S Complex Systems","Université Larbi Ben Mhidi de Oum El Bouaghi"]
[1240,"Université_Larbi_Ben_Mhidi_de_Oum_El_Bouaghi","Didactique De La Langue Arabe Et Du Texte Littéraire Dans Le Système D’Enseignement Algérien ; (Objectif Et Réalité).","Université Larbi Ben Mhidi de Oum El Bouaghi"]
[1241,"Université_Larbi_Ben_Mhidi_de_Oum_El_Bouaghi","Génie Électronique Automatique","Université Larbi Ben Mhidi de Oum El Bouaghi"]
[1242,"Université_Larbi_Ben_Mhidi_de_Oum_El_Bouaghi","Sciences Analytiques Matériaux et Environnement","Université Larbi Ben Mhidi de Oum El Bouaghi"]
[1243,"Université_Larbi_Tebessi_de_Tébessa","Matériaux Organiques Et Hétérochimie","Université Larbi Tebessi de Tébessa"]
[1244,"Université_Larbi_Tebessi_de_Tébessa","Energétique Et Turbomachine","Université Larbi Tebessi de Tébessa"]
[1245,"Université_Larbi_Tebessi_de_Tébessa","Environnement","Université Larbi Tebessi de Tébessa"]
[1246,"Université_Larbi_Tebessi_de_Tébessa","Mines","Université Larbi Tebessi de Tébessa"]
[1247,"Université_Larbi_Tebessi_de_Tébessa","Physique Appliquée Et Théorique","Université Larbi Tebessi de Tébessa"]
[1248,"Université_Larbi_Tebessi_de_Tébessa","Eau Et Environnement","Université Larbi Tebessi de Tébessa"]
[1249,"Université_Larbi_Tebessi_de_Tébessa","Environnement Sédimentaire, Ressources Minérales Et Hydriques De L’Algérie Orientale","Université Larbi Tebessi de Tébessa"]
[1250,"Université_Larbi_Tebessi_de_Tébessa","Etudes Environnementales Et Developpement Durable","Université Larbi Tebessi de Tébessa"]
[1251,"Université_Larbi_Tebessi_de_Tébessa","Etudes Humaines Et Littéraires","Université Larbi Tebessi de Tébessa"]
[1252,"Université_Larbi_Tebessi_de_Tébessa","Genie Civil Appliqué","Université Larbi Tebessi de Tébessa"]
[1253,"Université_Larbi_Tebessi_de_Tébessa","Génie Electrique","Université Larbi Tebessi de Tébessa"]
[1254,"Université_Larbi_Tebessi_de_Tébessa","Mathematiques, Informatiques Et Systemes","Université Larbi Tebessi de Tébessa"]
[1255,"Université_Larbi_Tebessi_de_Tébessa","Molécules Bioactives Et Applications","Université Larbi Tebessi de Tébessa"]
[1256,"Université_Lounici_Ali_de_Blida_2","Langue Arabe Et Sa Littérature","Université Lounici Ali de Blida 2"]
[1257,"Université_Lounici_Ali_de_Blida_2","Innovation Et Le Changement Des Organisations Et Institutions","Université Lounici Ali de Blida 2"]
[1258,"Université_Lounici_Ali_de_Blida_2","Etudes De Linguistique Théorique Et Pratique Généralev Et De L'Arabe","Université Lounici Ali de Blida 2"]
[1259,"Université_Lounici_Ali_de_Blida_2","Développement Économique Et Humain En Algérie","Université Lounici Ali de Blida 2"]
[1260,"Université_Lounici_Ali_de_Blida_2","Entreprenariat, La Gestion Des Ressources Humaines Et Le Développement Durable","Université Lounici Ali de Blida 2"]
[1261,"Université_Lounici_Ali_de_Blida_2","Défis Du Système Fiscal Algérien Dans Le Cadre Des Changements Économiques","Université Lounici Ali de Blida 2"]
[1262,"Université_Lounici_Ali_de_Blida_2","Enfance Et Éducation Préscolaire","Université Lounici Ali de Blida 2"]
[1263,"Université_Lounici_Ali_de_Blida_2","Gestion Des Collectivités Locales Et Leur Rôle Dans La Réalisation De Développement","Université Lounici Ali de Blida 2"]
[1264,"Université_Lounici_Ali_de_Blida_2","Psychométrie Et D'Études Psychologiques","Université Lounici Ali de Blida 2"]
[1265,"Université_Lounici_Ali_de_Blida_2","Crime Et Déviance Entre Culture Et Représentions Sociales.","Université Lounici Ali de Blida 2"]
[1266,"Université_Lounici_Ali_de_Blida_2","Développement Organisationnel Et Management Des Ressources Humaines","Université Lounici Ali de Blida 2"]
[1267,"Université_Lounici_Ali_de_Blida_2","Droit Et Foncier","Université Lounici Ali de Blida 2"]
[1268,"Université_Lounici_Ali_de_Blida_2","Etude De La Population, De La Santé Et Du Développement Durable En Algérie","Université Lounici Ali de Blida 2"]
[1269,"Université_Lounici_Ali_de_Blida_2","Etudes Littératures Et Critiques","Université Lounici Ali de Blida 2"]
[1270,"Université_Lounici_Ali_de_Blida_2","Santé, Psychologie, Education, Douance Et Créativité","Université Lounici Ali de Blida 2"]
[1271,"Université_Mohamed_Ben_Ahmed_Oran_2","Création D'Outils Pédagogiques En Langues Étrangères","Université Mohamed Ben Ahmed Oran 2"]
[1272,"Université_Mohamed_Ben_Ahmed Oran_2","Développement, Culture Et Politique : Cas De La Ville D'Oran","Université Mohamed Ben Ahmed Oran 2"]
[1273,"Université_Mohamed_Ben_Ahmed Oran_2","Economie Et Gestion Des Entreprises","Université Mohamed Ben Ahmed Oran 2"]
[1274,"Université_Mohamed_Ben_Ahmed Oran_2","Education Et Développement","Université Mohamed Ben Ahmed Oran 2"]
[1275,"Université_Mohamed_Ben_Ahmed Oran_2","Espace Géographique Et Aménagement Du Territoire","Université Mohamed Ben Ahmed Oran 2"]
[1276,"Université_Mohamed_Ben_Ahmed Oran_2","Linguistique, Dynamique Du Langage Et Didactique","Université Mohamed Ben Ahmed Oran 2"]
[1277,"Université_Mohamed_Ben_Ahmed Oran_2","Macro-Économie Organisationnelle","Université Mohamed Ben Ahmed Oran 2"]
[1278,"Université_Mohamed_Ben_Ahmed Oran_2","Ouvrages Pour Le Supérieur : Civilisation Et Didactique","Université Mohamed Ben Ahmed Oran 2"]
[1279,"Université_Mohamed_Ben_Ahmed Oran_2","Paléontologie Stratigraphique Et Paléoenvironnement","Université Mohamed Ben Ahmed Oran 2"]
[1280,"Université_Mohamed_Ben_Ahmed Oran_2","Philosophie Et Son Histoire","Université Mohamed Ben Ahmed Oran 2"]
[1281,"Université_Mohamed_Ben_Ahmed Oran_2","Psychologie Et Sciences De L'Éducation","Université Mohamed Ben Ahmed Oran 2"]
[1282,"Université_Mohamed_Ben_Ahmed Oran_2","Entreprise Et Commerce","Université Mohamed Ben Ahmed Oran 2"]
[1283,"Université_Mohamed_Ben_Ahmed Oran_2","Processus Éducatifs Et Contexte Social En Algérie","Université Mohamed Ben Ahmed Oran 2"]
[1284,"Université_Mohamed_Ben_Ahmed Oran_2","Traduction Et Méthodologie","Université Mohamed Ben Ahmed Oran 2"]
[1285,"Université_Mohamed_Ben_Ahmed Oran_2","Application De La Psychologie Et De La Pédagogie Pour Le Développement En Algérie","Université Mohamed Ben Ahmed Oran 2"]
[1286,"Université_Mohamed_Ben_Ahmed Oran_2","Droit Économique Et Environnement","Université Mohamed Ben Ahmed Oran 2"]
[1287,"Université_Mohamed_Ben_Ahmed Oran_2","Droit Social (Labdros)","Université Mohamed Ben Ahmed Oran 2"]
[1288,"Université_Mohamed_Ben_Ahmed Oran_2","Economies Euroméditéranéennes","Université Mohamed Ben Ahmed Oran 2"]
[1289,"Université_Mohamed_Ben_Ahmed Oran_2","Protection Juridique Et Sociale De L'Enfant En Droit Algérien Et En Droit Comparé","Université Mohamed Ben Ahmed Oran 2"]
[1290,"Université_Mohamed_Ben_Ahmed Oran_2","Dimensions Et Valeurs Des Transformations Idéologiques Et Politiques En Algérie","Université Mohamed Ben Ahmed Oran 2"]
[1291,"Université_Mohamed_Ben_Ahmed Oran_2","Langues, Littératures Et Civilisation/Histoires En Afrique","Université Mohamed Ben Ahmed Oran 2"]
[1292,"Université_Mohamed_Ben_Ahmed Oran_2","Droits De Transport Et Des Activités Portuaires","Université Mohamed Ben Ahmed Oran 2"]
[1293,"Université_Mohamed_Ben_Ahmed Oran_2","Droit, Société Et Pouvoir","Université Mohamed Ben Ahmed Oran 2"]
[1294,"Université_Mohamed_Ben_Ahmed Oran_2","Reformes Économiques Et Intégration Régionale Et Internationale","Université Mohamed Ben Ahmed Oran 2"]
[1295,"Université_Mohamed_Ben_Ahmed Oran_2","Langues Étrangères Appliquées, Sciences Exactes, Technologie Et Développement","Université Mohamed Ben Ahmed Oran 2"]
[1296,"Université_Mohamed_Ben_Ahmed Oran_2","Stratégies De Population Et Développement Durable","Université Mohamed Ben Ahmed Oran 2"]
[1297,"Université_Mohamed_Ben_Ahmed Oran_2","Géoressources, Environnement Et Risques Naturels","Université Mohamed Ben Ahmed Oran 2"]
[1298,"Université_Mohamed_Ben_Ahmed Oran_2","Philosophie Et Histoire Du Temps Présent","Université Mohamed Ben Ahmed Oran 2"]
[1299,"Université_Mohamed_Ben_Ahmed Oran_2","Philosophie, Sciences Et Develpppement En Algérie","Université Mohamed Ben Ahmed Oran 2"]
[1300,"Université_Mohamed_Ben_Ahmed Oran_2","Recherche Appliquée Sur La Firme, L'Industrie Et Le Territoire","Université Mohamed Ben Ahmed Oran 2"]
[1301,"Université_Mohamed_Ben_Ahmed Oran_2","Systèmes, Structures, Modèles Et Pratiques : Philosophie, Sciences Sociales Et Traduction","Université Mohamed Ben Ahmed Oran 2"]
[1302,"Université_Mohamed_Ben_Ahmed Oran_2","Dynamiques Urbaines Et Evolution Sociale En Algerie","Université Mohamed Ben Ahmed Oran 2"]
[1303,"Université_Mohamed_Ben_Ahmed Oran_2","Ergonomie Et Prévention Des Risques","Université Mohamed Ben Ahmed Oran 2"]
[1304,"Université_Mohamed_Ben_Ahmed Oran_2","Géodynamique Des Bassins Et Bilan Sédimentaire","Université Mohamed Ben Ahmed Oran 2"]
[1305,"Université_Mohamed_Ben_Ahmed Oran_2","Investissement Et Développement Durable","Université Mohamed Ben Ahmed Oran 2"]
[1306,"Université_Mohamed_Ben_Ahmed Oran_2","Langue Française Au Maghreb ; Pratiques De Suivi Et Évaluation De Compétences En Francophonie","Université Mohamed Ben Ahmed Oran 2"]
[1307,"Université_Mohamed_Ben_Ahmed Oran_2","Langue, Discours, Civilisations Et Littératures","Université Mohamed Ben Ahmed Oran 2"]
[1308,"Université_Mohamed_Ben_Ahmed Oran_2","Système, Contrats Et Responsabilité Bancaires","Université Mohamed Ben Ahmed Oran 2"]
[1309,"Université_Mohamed_Ben_Ahmed Oran_2","Unité De Recherche: Sciences Sociales (Remplace Lr2001 Anthropologie De La Santé)","Université Mohamed Ben Ahmed Oran 2"]
[1310,"Université_Mohamed_Ben_Ahmed Oran_2","Sciences Criminelles","Université Mohamed Ben Ahmed Oran 2"]
[1311,"Université_Mohamed_Ben_Ahmed Oran_2","Ingénierie De La Sécurité Industrielle Et Du Développement Durable","Université Mohamed Ben Ahmed Oran 2"]
[1312,"Université_Mohamed_Ben_Ahmed Oran_2","Moyens D'Investigation Et Techniques Thérapeutiques Des Troubles Du Comportement","Université Mohamed Ben Ahmed Oran 2"]
[1313,"Université_Mohamed_Boudiaf_de_Msila","Matériaux Inorganiques","Université Mohamed Boudiaf de Msila"]
[1314,"Université_Mohamed_Boudiaf_de_Msila","Mathématiques Pures Et Appliquées","Université Mohamed Boudiaf de Msila"]
[1315,"Université_Mohamed_Boudiaf_de_Msila","Physique Et Chimie Des Matériaux","Université Mohamed Boudiaf de Msila"]
[1316,"Université_Mohamed_Boudiaf_de_Msila","Développement Des Géo-Matériaux","Université Mohamed Boudiaf de Msila"]
[1317,"Université_Mohamed_Boudiaf_de_Msila","Technique Urbaine Et Environnement","Université Mohamed Boudiaf de Msila"]
[1318,"Université_Mohamed_Boudiaf_de_Msila","Analyse Des Signaux Et Systèmes","Université Mohamed Boudiaf de Msila"]
[1319,"Université_Mohamed_Boudiaf_de_Msila","Poésie Algérienne","Université Mohamed Boudiaf de Msila"]
[1320,"Université_Mohamed_Boudiaf_de_Msila","Stratégies Et Politiques Economiques En Algérie","Université Mohamed Boudiaf de Msila"]
[1321,"Université_Mohamed_Boudiaf_de_Msila","Etudes Historiques, De Sociologie Et Des Changements Sociaux Et Économiques","Université Mohamed Boudiaf de Msila"]
[1322,"Université_Mohamed_Boudiaf_de_Msila","Analyse Fonctionnelle Et Géométrie Des Espaces","Université Mohamed Boudiaf de Msila"]
[1323,"Université_Mohamed_Boudiaf_de_Msila","Apprentissage Et Contrôle Moteur","Université Mohamed Boudiaf de Msila"]
[1324,"Université_Mohamed_Boudiaf_de_Msila","Communication Et Société","Université Mohamed Boudiaf de Msila"]
[1325,"Université_Mohamed_Boudiaf_de_Msila","Etudes De Linguistique Théorique Et Pratique","Université Mohamed Boudiaf de Msila"]
[1326,"Université_Mohamed_Boudiaf_de_Msila","Etudes Et Recherche Sur La Révolution Algérienne","Université Mohamed Boudiaf de Msila"]
[1327,"Université_Mohamed_Boudiaf_de_Msila","Exécution Des Jugements De Justice, Civil, Commercial, Administratif, Pénal Et En Référé","Université Mohamed Boudiaf de Msila"]
[1328,"Université_Mohamed_Boudiaf_de_Msila","Genie Electrique","Université Mohamed Boudiaf de Msila"]
[1329,"Université_Mohamed_Boudiaf_de_Msila","Life Skills","Université Mohamed Boudiaf de Msila"]
[1330,"Université_Mohamed_Boudiaf_de_Msila","Matériaux Et Mécanique Des Structures","Université Mohamed Boudiaf de Msila"]
[1331,"Université_Mohamed_Boudiaf_de_Msila","Nouvelles Sciences Politiques","Université Mohamed Boudiaf de Msila"]
[1332,"Université_Mohamed_Boudiaf_de_Msila","Planification Des Ressources Humaines Et L'Amélioration Des Performances","Université Mohamed Boudiaf de Msila"]
[1333,"Université_Mohamed_Boudiaf_de_Msila","Programmes Des Activités Physiques Et Sportives Adaptées","Université Mohamed Boudiaf de Msila"]
[1334,"Université_Mohamed_Boudiaf_de_Msila","Psychologie De Santé Et Du Développement","Université Mohamed Boudiaf de Msila"]
[1335,"Université_Mohamed_Boudiaf_de_Msila","Physique Des Matrèriaux Et Ses Applications","Université Mohamed Boudiaf de Msila"]
[1336,"Université_Mohamed_Boudiaf_de_Msila","Sémiologie De Théâtre Entre La Théorie Et Le Pratique","Université Mohamed Boudiaf de Msila"]
[1337,"Université_Mohamed_Boudiaf_de_Msila","études anthropologiques et problèmes sociaux","Université Mohamed Boudiaf de Msila"]
[1338,"Université_Mohamed_Boudiaf_de_Msila","Etudes et Recherches en Droit, Famille et Développement Administratif","Université Mohamed Boudiaf de Msila"]
[1339,"Université_Mohamed_Boudiaf_de_Msila","Sociologie de la Qualité du Service Public","Université Mohamed Boudiaf de Msila"]
[1340,"Université_Mohamed_Boudiaf_de_Msila","Ville, Environnement, Société et Développement Durable","Université Mohamed Boudiaf de Msila"]
[1341,"Université_Mohamed_Cherif_Mesaadia_de_Souk_Ahras","Gestion Maintenance Et Réhalibilitation Des Infrastructures Urbaines","Université Mohamed Cherif Mesaadia de Souk Ahras"]
[1342,"Université_Mohamed_Cherif_Mesaadia_de_Souk_Ahras","Sciences Et Technique De L'Eau Et Environnement","Université Mohamed Cherif Mesaadia de Souk Ahras"]
[1343,"Université_Mohamed_Cherif_Mesaadia_de_Souk_Ahras","Ecosystèmes Aquatiques Et Terrestres","Université Mohamed Cherif Mesaadia de Souk Ahras"]
[1344,"Université_Mohamed_Cherif_Mesaadia_de_Souk_Ahras","Electrotechnique Et Energies Renouvelables","Université Mohamed Cherif Mesaadia de Souk Ahras"]
[1345,"Université_Mohamed_Cherif_Mesaadia_de_Souk_Ahras","Etudes Linguistiques Et Littéraires","Université Mohamed Cherif Mesaadia de Souk Ahras"]
[1346,"Université_Mohamed_Cherif_Mesaadia_de_Souk_Ahras","Physique De La Matière Et Du Rayonnement","Université Mohamed Cherif Mesaadia de Souk Ahras"]
[1347,"Université_Mohamed_Cherif_Mesaadia_de_Souk_Ahras","Psychologie Des Activités Physiques Et Sportives","Université Mohamed Cherif Mesaadia de Souk Ahras"]
[1348,"Université_Mohamed_Cherif_Mesaadia_de_Souk_Ahras","Recherches Et Études Économiques","Université Mohamed Cherif Mesaadia de Souk Ahras"]
[1349,"Université_Mohamed_Cherif_Mesaadia_de_Souk_Ahras","Informatique Et Mathématiques","Université Mohamed Cherif Mesaadia de Souk Ahras"]
[1350,"Université_Mohamed_Cherif_Mesaadia_de_Souk_Ahras","Jeunes Et Problèmes Sociaux","Université Mohamed Cherif Mesaadia de Souk Ahras"]
[1351,"Université_Mohamed_Cherif_Mesaadia_de_Souk_Ahras","Sciences Et Techniques Du Vivant","Université Mohamed Cherif Mesaadia de Souk Ahras"]
[1352,"Université_Mohamed_Cherif_Mesaadia_de_Souk_Ahras","Finance, comptabilité,  fiscalité et assurance","Université Mohamed Cherif Mesaadia de Souk Ahras"]
[1353,"Université_Mohamed_Cherif_Mesaadia_de_Souk_Ahras","Productions Animales, Biotechnologie et Santé","Université Mohamed Cherif Mesaadia de Souk Ahras"]
[1354,"Université_Mohamed_El_Bachir_El_Ibrahimi_de_Bordj_Bou_Arréridj","Matériaux Et Systèmes Électroniques","Université Mohamed El Bachir El Ibrahimi de Bordj Bou Arréridj"]
[1355,"Université_Mohamed_El_Bachir_El_Ibrahimi_de_Bordj_Bou_Arréridj","Caractérisation Et Valorisation Des Ressources Naturelles","Université Mohamed El Bachir El Ibrahimi de Bordj Bou Arréridj"]
[1356,"Université_Mohamed_El_Bachir_El_Ibrahimi_de_Bordj_Bou_Arréridj","Etudes Et Recherche En Développement Rural Lerdr","Université Mohamed El Bachir El Ibrahimi de Bordj Bou Arréridj"]
[1357,"Université_Mohamed_El_Bachir_El_Ibrahimi_de_Bordj_Bou_Arréridj","Études Économiques Sur Les Zones Industrielles Et Le Nouveau Rôle De L'Université, \"Le Cas De Bordj Bou Arreridj\"","Université Mohamed El Bachir El Ibrahimi de Bordj Bou Arréridj"]
[1358,"Université_Mohamed_El_Bachir_El_Ibrahimi_de_Bordj_Bou_Arréridj","Physique Des Matériaux, Rayonnements Et Nanostructures.","Université Mohamed El Bachir El Ibrahimi de Bordj Bou Arréridj"]
[1359,"Université_Mohamed_El_Bachir_El_Ibrahimi_de_Bordj_Bou_Arréridj","Electronique et des Télécommunications Avancées","Université Mohamed El Bachir El Ibrahimi de Bordj Bou Arréridj"]
[1360,"Université_Mohamed_Essedik_Ben_Yahia_de_Jijel","Essais Non-Destructifs","Université Mohamed Essedik Ben Yahia de Jijel"]
[1361,"Université_Mohamed_Essedik_Ben_Yahia_de_Jijel","Etudes Des Interactions Matériaux Et Environnement","Université Mohamed Essedik Ben Yahia de Jijel"]
[1362,"Université_Mohamed_Essedik_Ben_Yahia_de_Jijel","Etudes Des Matériaux","Université Mohamed Essedik Ben Yahia de Jijel"]
[1363,"Université_Mohamed_Essedik_Ben_Yahia_de_Jijel","Pharmacologie Et Phytochimie","Université Mohamed Essedik Ben Yahia de Jijel"]
[1364,"Université_Mohamed_Essedik_Ben_Yahia_de_Jijel","Génie Géologique","Université Mohamed Essedik Ben Yahia de Jijel"]
[1365,"Université_Mohamed_Essedik_Ben_Yahia_de_Jijel","Cadre Bati Et Environnement","Université Mohamed Essedik Ben Yahia de Jijel"]
[1366,"Université_Mohamed_Essedik_Ben_Yahia_de_Jijel","Physique Théorique","Université Mohamed Essedik Ben Yahia de Jijel"]
[1367,"Université_Mohamed_Essedik_Ben_Yahia_de_Jijel","Mathématiques Pures Et Appliquées","Université Mohamed Essedik Ben Yahia de Jijel"]
[1368,"Université_Mohamed_Essedik_Ben_Yahia_de_Jijel","Toxicologie Moléculaire","Université Mohamed Essedik Ben Yahia de Jijel"]
[1369,"Université_Mohamed_Essedik_Ben_Yahia_de_Jijel","Physique De Rayonnement Et Applications","Université Mohamed Essedik Ben Yahia de Jijel"]
[1370,"Université_Mohamed_Essedik_Ben_Yahia_de_Jijel","Automatique De Jijel","Université Mohamed Essedik Ben Yahia de Jijel"]
[1371,"Université_Mohamed_Essedik_Ben_Yahia_de_Jijel","Biologie Moléculaire Et Cellulaire","Université Mohamed Essedik Ben Yahia de Jijel"]
[1372,"Université_Mohamed_Essedik_Ben_Yahia_de_Jijel","Biotechnologie, Environnement Et Santé","Université Mohamed Essedik Ben Yahia de Jijel"]
[1373,"Université_Mohamed_Essedik_Ben_Yahia_de_Jijel","Droit Bancaire Et Financier","Université Mohamed Essedik Ben Yahia de Jijel"]
[1374,"Université_Mohamed_Essedik_Ben_Yahia_de_Jijel","Electrotechnique Et D'Electronique Industrielle","Université Mohamed Essedik Ben Yahia de Jijel"]
[1375,"Université_Mohamed_Essedik_Ben_Yahia_de_Jijel","Energétique Appliquée Et Matériaux","Université Mohamed Essedik Ben Yahia de Jijel"]
[1376,"Université_Mohamed_Essedik_Ben_Yahia_de_Jijel","Energies Renouvelables","Université Mohamed Essedik Ben Yahia de Jijel"]
[1377,"Université_Mohamed_Essedik_Ben_Yahia_de_Jijel","Matériaux : Élaborations-Propriétés-Applications","Université Mohamed Essedik Ben Yahia de Jijel"]
[1378,"Université_Mohamed_Essedik_Ben_Yahia_de_Jijel","Mathématiques Et Applications Des Mathématiques","Université Mohamed Essedik Ben Yahia de Jijel"]
[1379,"Université_Mohamed_Essedik_Ben_Yahia_de_Jijel","Physique De La Matière Condensée Et Nanomatériaux","Université Mohamed Essedik Ben Yahia de Jijel"]
[1380,"Université_Mohamed_Essedik_Ben_Yahia_de_Jijel","Sociolinguistique, Socio- Didactique Et Socio-Littérature","Université Mohamed Essedik Ben Yahia de Jijel"]
[1381,"Université_Mohamed_Essedik_Ben_Yahia_de_Jijel","Gènie Civil Et Environnement","Université Mohamed Essedik Ben Yahia de Jijel"]
[1382,"Université_Mohamed_Essedik_Ben_Yahia_de_Jijel","Mécatronique De Jijel","Université Mohamed Essedik Ben Yahia de Jijel"]
[1383,"Université_Mohamed_Essedik_Ben_Yahia_de_Jijel","Langue et analyse du discours","Université Mohamed Essedik Ben Yahia de Jijel"]
[1384,"Université_Mohamed_Khider_de_Biskra","Aménagements Hydrauliques Et Environnement","Université Mohamed Khider de Biskra"]
[1385,"Université_Mohamed_Khider_de_Biskra","Chimie Appliquée","Université Mohamed Khider de Biskra"]
[1386,"Université_Mohamed_Khider_de_Biskra","Génie Civil","Université Mohamed Khider de Biskra"]
[1387,"Université_Mohamed_Khider_de_Biskra","Hydraulique Souterraine Et Surface","Université Mohamed Khider de Biskra"]
[1388,"Université_Mohamed_Khider_de_Biskra","Matériaux Semi-Conducteurs Et Métalliques","Université Mohamed Khider de Biskra"]
[1389,"Université_Mohamed_Khider_de_Biskra","Mathématiques Appliquées","Université Mohamed Khider de Biskra"]
[1390,"Université_Mohamed_Khider_de_Biskra","Modélisation Des Systèmes Energétiques","Université Mohamed Khider de Biskra"]
[1391,"Université_Mohamed_Khider_de_Biskra","Systèmes Experts, L'Imagerie Et Leurs Applications Dans L'Ingénierie","Université Mohamed Khider de Biskra"]
[1392,"Université_Mohamed_Khider_de_Biskra","Impact De La Jurisprudence Sur La Dynamique De La Législation","Université Mohamed Khider de Biskra"]
[1393,"Université_Mohamed_Khider_de_Biskra","Langue Et Littérature Algériennes","Université Mohamed Khider de Biskra"]
[1394,"Université_Mohamed_Khider_de_Biskra","Problématique De L'Éducation En Algérie À L'Ombre Des Contraintes Actuelles","Université Mohamed Khider de Biskra"]
[1395,"Université_Mohamed_Khider_de_Biskra","Sciences Économiques Et Sciences De Gestion","Université Mohamed Khider de Biskra"]
[1396,"Université_Mohamed_Khider_de_Biskra","Génie Électrique De Biskra","Université Mohamed Khider de Biskra"]
[1397,"Université_Mohamed_Khider_de_Biskra","Conception Et Modélisation Des Formes Et Des Ambiances Architecturales Urbaines","Université Mohamed Khider de Biskra"]
[1398,"Université_Mohamed_Khider_de_Biskra","Génie Mécanique","Université Mohamed Khider de Biskra"]
[1399,"Université_Mohamed_Khider_de_Biskra","Unité De Formation Et La Recherche Dans Les Théories Des Lecteurs Et Ses Méthodes","Université Mohamed Khider de Biskra"]
[1400,"Université_Mohamed_Khider_de_Biskra","Changement Social Et Relation Publique En Algérie","Université Mohamed Khider de Biskra"]
[1401,"Université_Mohamed_Khider_de_Biskra","Finances, Banque Et Management","Université Mohamed Khider de Biskra"]
[1402,"Université_Mohamed_Khider_de_Biskra","Chimie Moléculaire Et Environnement","Université Mohamed Khider de Biskra"]
[1403,"Université_Mohamed_Khider_de_Biskra","Génie Civil Et Hydraulique, Développement Durable Et Environnement","Université Mohamed Khider de Biskra"]
[1404,"Université_Mohamed_Khider_de_Biskra","Linguistique Et Langue Arabe","Université Mohamed Khider de Biskra"]
[1405,"Université_Mohamed_Khider_de_Biskra","Droits Et Libertés Dans Les Systèmes Comparés","Université Mohamed Khider de Biskra"]
[1406,"Université_Mohamed_Khider_de_Biskra","Génie Énergétique Et Matériaux","Université Mohamed Khider de Biskra"]
[1407,"Université_Mohamed_Khider_de_Biskra","Modélisation Numérique Et Instrumentation En Interaction Sol-Structure","Université Mohamed Khider de Biskra"]
[1408,"Université_Mohamed_Khider_de_Biskra","Diversité Des Écosystèmes Et Dynamiques Des Systèmes De Production Agricoles En Zones Arides","Université Mohamed Khider de Biskra"]
[1409,"Université_Mohamed_Khider_de_Biskra","Etudes Et Recherches Dans Les Sciences Et Techniques Des Activités Physiques Et Sportives","Université Mohamed Khider de Biskra"]
[1410,"Université_Mohamed_Khider_de_Biskra","Etudes Psychologiques Et Sociologiques","Université Mohamed Khider de Biskra"]
[1411,"Université_Mohamed_Khider_de_Biskra","Identification, Commande, Contrôle Et Communication","Université Mohamed Khider de Biskra"]
[1412,"Université_Mohamed_Khider_de_Biskra","Informatique Intelligente","Université Mohamed Khider de Biskra"]
[1413,"Université_Mohamed_Khider_de_Biskra","Physique Des Couches Minces Et Applications","Université Mohamed Khider de Biskra"]
[1414,"Université_Mohamed_Khider_de_Biskra","Physique Photonique Et Nanomatériaux Multifonctionnels","Université Mohamed Khider de Biskra"]
[1415,"Université_Mohamed_Khider_de_Biskra","Génétique, Biotechnologie et Valorisation de Bio-ressources","Université Mohamed Khider de Biskra"]
[1416,"Université_Mohamed_Lakhdar_Ben_Amara_dit_Hamma_Lakhdar_El_Oued","Valorisation Et Technologie Des Ressources Sahariennes","Université Mohamed Lakhdar Ben Amara dit Hamma Lakhdar El Oued"]
[1417,"Université_Mohamed_Lakhdar_Ben_Amara_dit_Hamma_Lakhdar_El_Oued","Exploitation Et De Valorisation Des Ressources Énergétiques Sahariennes","Université Mohamed Lakhdar Ben Amara dit Hamma Lakhdar El Oued"]
[1418,"Université_Mohamed_Lakhdar_Ben_Amara_dit_Hamma_Lakhdar_El_Oued","Théorie Des Opérateurs Et Edp","Université Mohamed Lakhdar Ben Amara dit Hamma Lakhdar El Oued"]
[1419,"Université_Mohamed_Lakhdar_Ben_Amara_dit_Hamma_Lakhdar_El_Oued","Algerian Scientists Contributions To enrich The Islamic Studies   ","Université Mohamed Lakhdar Ben Amara dit Hamma Lakhdar El Oued"]
[1420,"Université_Mohamed_Lakhdar_Ben_Amara_dit_Hamma_Lakhdar_El_Oued","Etudes Doctrinales et Judiciares","Université Mohamed Lakhdar Ben Amara dit Hamma Lakhdar El Oued"]
[1421,"Université_Mohamed_Lakhdar_Ben_Amara_dit_Hamma_Lakhdar_El_Oued","La croissance et le développement économique dans les pays arabes","Université Mohamed Lakhdar Ben Amara dit Hamma Lakhdar El Oued"]
[1422,"Université_Mohamed_Lakhdar_Ben_Amara_dit_Hamma_Lakhdar_El_Oued","Neuropsychologie Cognitive et Sociale ","Université Mohamed Lakhdar Ben Amara dit Hamma Lakhdar El Oued"]
[1423,"Université_Mohamed_Lakhdar_Ben_Amara_dit_Hamma_Lakhdar_El_Oued","Politique de détective et d'améliorer le service public en Algérie ","Université Mohamed Lakhdar Ben Amara dit Hamma Lakhdar El Oued"]
[1424,"Université_Mouloud_Maameri_de_Tizi_Ouzou","Biochimie Analytique Et Biotechnologies","Université Mouloud Maameri de Tizi Ouzou"]
[1425,"Université_Mouloud_Maameri_de_Tizi_Ouzou","Chimie Appliquée Et Génie Chimique","Université Mouloud Maameri de Tizi Ouzou"]
[1426,"Université_Mouloud_Maameri_de_Tizi_Ouzou","Eau","Université Mouloud Maameri de Tizi Ouzou"]
[1427,"Université_Mouloud_Maameri_de_Tizi_Ouzou","Physique Et Chimie Quantique","Université Mouloud Maameri de Tizi Ouzou"]
[1428,"Université_Mouloud_Maameri_de_Tizi_Ouzou","Réformes Économiques Et Dynamiques Locales","Université Mouloud Maameri de Tizi Ouzou"]
[1429,"Université_Mouloud_Maameri_de_Tizi_Ouzou","Analyse Et Modélisation Des Phénomènes Aléatoires","Université Mouloud Maameri de Tizi Ouzou"]
[1430,"Université_Mouloud_Maameri_de_Tizi_Ouzou","Conception Et Conduite Des Systèmes De Production","Université Mouloud Maameri de Tizi Ouzou"]
[1431,"Université_Mouloud_Maameri_de_Tizi_Ouzou","Immunologie","Université Mouloud Maameri de Tizi Ouzou"]
[1432,"Université_Mouloud_Maameri_de_Tizi_Ouzou","Mécanique, Structures Et Énergétique","Université Mouloud Maameri de Tizi Ouzou"]
[1433,"Université_Mouloud_Maameri_de_Tizi_Ouzou","Mondialisation Et Droit National","Université Mouloud Maameri de Tizi Ouzou"]
[1434,"Université_Mouloud_Maameri_de_Tizi_Ouzou","Production, Amélioration Et Protection Des Végétaux Et Des Denrées Alimentaires","Université Mouloud Maameri de Tizi Ouzou"]
[1435,"Université_Mouloud_Maameri_de_Tizi_Ouzou","Ressources Naturelles","Université Mouloud Maameri de Tizi Ouzou"]
[1436,"Université_Mouloud_Maameri_de_Tizi_Ouzou","Géomatériaux, Environnement Et Aménagements","Université Mouloud Maameri de Tizi Ouzou"]
[1437,"Université_Mouloud_Maameri_de_Tizi_Ouzou","Informatique","Université Mouloud Maameri de Tizi Ouzou"]
[1438,"Université_Mouloud_Maameri_de_Tizi_Ouzou","Mathématiques Pures Et Appliquées","Université Mouloud Maameri de Tizi Ouzou"]
[1439,"Université_Mouloud_Maameri_de_Tizi_Ouzou","Modélisation Expérimentale Et Numérique Des Matériaux Et Structures En Génie Civil","Université Mouloud Maameri de Tizi Ouzou"]
[1440,"Université_Mouloud_Maameri_de_Tizi_Ouzou","Analyse De Discours","Université Mouloud Maameri de Tizi Ouzou"]
[1441,"Université_Mouloud_Maameri_de_Tizi_Ouzou","Technologie Avancée En Génie Électrique","Université Mouloud Maameri de Tizi Ouzou"]
[1442,"Université_Mouloud_Maameri_de_Tizi_Ouzou","Energétique mécanique et matériaux","Université Mouloud Maameri de Tizi Ouzou"]
[1443,"Université_Mouloud_Maameri_de_Tizi_Ouzou","Génie Electrique","Université Mouloud Maameri de Tizi Ouzou"]
[1444,"Université_Mouloud_Maameri_de_Tizi_Ouzou","Aménagement Et Ensignement De La Langue Amazighe","Université Mouloud Maameri de Tizi Ouzou"]
[1445,"Université_Mouloud_Maameri_de_Tizi_Ouzou","Pratiques Langagières En Algérie","Université Mouloud Maameri de Tizi Ouzou"]
[1446,"Université_Mouloud_Maameri_de_Tizi_Ouzou","Physique Et Chimie Des Matériaux","Université Mouloud Maameri de Tizi Ouzou"]
[1447,"Université_Mouloud_Maameri_de_Tizi_Ouzou","Elaboration Et Caractérisation Des Matériaux Et Modélisation (Lec2M)","Université Mouloud Maameri de Tizi Ouzou"]
[1448,"Université_Mouloud_Maameri_de_Tizi_Ouzou","Production, Sauvegarde Des Espèces Menacées Et Des Récoltes. Influence Des Variations Climatiques","Université Mouloud Maameri de Tizi Ouzou"]
[1449,"Université_Mouloud_Maameri_de_Tizi_Ouzou","Recherche Opérationnelle Et Mathématiques De La Décision","Université Mouloud Maameri de Tizi Ouzou"]
[1450,"Université_Mouloud_Maameri_de_Tizi_Ouzou","Droit Et Nouvelles Technologies","Université Mouloud Maameri de Tizi Ouzou"]
[1451,"Université_Mouloud_Maameri_de_Tizi_Ouzou","Langues Et Cultures Etrangeres","Université Mouloud Maameri de Tizi Ouzou"]
[1452,"Université_Mouloud_Maameri_de_Tizi_Ouzou","Management Des Organisations","Université Mouloud Maameri de Tizi Ouzou"]
[1453,"Université_Mouloud_Maameri_de_Tizi_Ouzou","Métallurgie Et De Génie Des Matériaux Métalliques","Université Mouloud Maameri de Tizi Ouzou"]
[1454,"Université_Mouloud_Maameri_de_Tizi_Ouzou","Recherches En Traduction","Université Mouloud Maameri de Tizi Ouzou"]
[1455,"Université_Mouloud_Maameri_de_Tizi_Ouzou","Représentation Intellectuelle Et Culturelle","Université Mouloud Maameri de Tizi Ouzou"]
[1456,"Université_Mouloud_Maameri_de_Tizi_Ouzou","Société-Éducation-Travail","Université Mouloud Maameri de Tizi Ouzou"]
[1457,"Université_Mouloud_Maameri_de_Tizi_Ouzou","Ecologie Et Biologie Des Ecosystèmes Terrestres","Université Mouloud Maameri de Tizi Ouzou"]
[1458,"Université_Mouloud_Maameri_de_Tizi_Ouzou","Qualité Et Sécurité Des Aliments","Université Mouloud Maameri de Tizi Ouzou"]
[1459,"Université_Mouloud_Maameri_de_Tizi_Ouzou","Vision Artificielle Et Automatique Des Systèmes","Université Mouloud Maameri de Tizi Ouzou"]
[1460,"Université_Mustapha_Stambouli_de_Mascara","Systèmes Biologiques Et La Géomatique","Université Mustapha Stambouli de Mascara"]
[1461,"Université_Mustapha_Stambouli_de_Mascara","Management Des Collectivités Locales Et Développement Local","Université Mustapha Stambouli de Mascara"]
[1462,"Université_Mustapha_Stambouli_de_Mascara","Physique Quantique De La Matière Et Modélisations Mathématiques","Université Mustapha Stambouli de Mascara"]
[1463,"Université_Mustapha_Stambouli_de_Mascara","Sciences Et Techniques De L'Eau","Université Mustapha Stambouli de Mascara"]
[1464,"Université_Mustapha_Stambouli_de_Mascara","Chimie Organique, Macromoléculaire Et Des Matériaux","Université Mustapha Stambouli de Mascara"]
[1465,"Université_Mustapha_Stambouli_de_Mascara","Recherches Sociologiques Et Historiques","Université Mustapha Stambouli de Mascara"]
[1466,"Université_Mustapha_Stambouli_de_Mascara","Chimie Physique Des Macromolécules Et Interfaces Biologiques","Université Mustapha Stambouli de Mascara"]
[1467,"Université_Mustapha_Stambouli_de_Mascara","Géo-Environnement Et Développement Des Espaces","Université Mustapha Stambouli de Mascara"]
[1468,"Université_Mustapha_Stambouli_de_Mascara","Matériaux, Applications Et Environnement","Université Mustapha Stambouli de Mascara"]
[1469,"Université_Mustapha_Stambouli_de_Mascara","Bioconversion, Génie Microbiologique Et Sécurité Sanitaire","Université Mustapha Stambouli de Mascara"]
[1470,"Université_Mustapha_Stambouli_de_Mascara","Législations En Droit Economique","Université Mustapha Stambouli de Mascara"]
[1471,"Université_Mustapha_Stambouli_de_Mascara","Méthodologies De La Critique Moderne Et L’Analyse Du Discours","Université Mustapha Stambouli de Mascara"]
[1472,"Université_Mustapha_Stambouli_de_Mascara","Outils Juridiques De La Politique Foncière","Université Mustapha Stambouli de Mascara"]
[1473,"Université_Mustapha_Stambouli_de_Mascara","Analyse, De Prospective Et De Développement Des Emplois Et Des Compétences","Université Mustapha Stambouli de Mascara"]
[1474,"Université_Mustapha_Stambouli_de_Mascara","Génie Des Procédes Et Chimie Des Solutions","Université Mustapha Stambouli de Mascara"]
[1475,"Université_Mustapha_Stambouli_de_Mascara","Géomatique, Ecologie Et Environnement","Université Mustapha Stambouli de Mascara"]
[1476,"Université_Mustapha_Stambouli_de_Mascara","Pme, Recherches Et Innovation","Université Mustapha Stambouli de Mascara"]
[1477,"Université_Mustapha_Stambouli_de_Mascara","Ingénierie Des Programmes De Langue Dans Les Filières De Spécialité","Université Mustapha Stambouli de Mascara"]
[1478,"Université_Omar_Telidji_de_Laghouat","Génie Civil","Université Omar Telidji de Laghouat"]
[1479,"Université_Omar_Telidji_de_Laghouat","Langue Arabe Et Sa Littérature","Université Omar Telidji de Laghouat"]
[1480,"Université_Omar_Telidji_de_Laghouat","Sciences Économiques Et Gestion","Université Omar Telidji de Laghouat"]
[1481,"Université_Omar_Telidji_de_Laghouat","Sciences Fondamentales","Université Omar Telidji de Laghouat"]
[1482,"Université_Omar_Telidji_de_Laghouat","Etude Et Développement Des Matériaux Semi-Conducteurs Et Diélectriques","Université Omar Telidji de Laghouat"]
[1483,"Université_Omar_Telidji_de_Laghouat","Génie Des Procédés","Université Omar Telidji de Laghouat"]
[1484,"Université_Omar_Telidji_de_Laghouat","Informatique Et Mathématiques","Université Omar Telidji de Laghouat"]
[1485,"Université_Omar_Telidji_de_Laghouat","Mécanique","Université Omar Telidji de Laghouat"]
[1486,"Université_Omar_Telidji_de_Laghouat","Analyse Et De Commande Des Systèmes D'Énergie Et Réseaux Électriques","Université Omar Telidji de Laghouat"]
[1487,"Université_Omar_Telidji_de_Laghouat","Sciences Du Langage","Université Omar Telidji de Laghouat"]
[1488,"Université_Omar_Telidji_de_Laghouat","Télécommunications, Signaux Et Systèmes","Université Omar Telidji de Laghouat"]
[1489,"Université_Omar_Telidji_de_Laghouat","Etude Du Développement Économique","Université Omar Telidji de Laghouat"]
[1490,"Université_Omar_Telidji_de_Laghouat","Linguistique Contrastive Et Caractères Des Langues","Université Omar Telidji de Laghouat"]
[1491,"Université_Omar_Telidji_de_Laghouat","Linguistique Pragmatique Et Analyse De Discours Littéraire","Université Omar Telidji de Laghouat"]
[1492,"Université_Omar_Telidji_de_Laghouat","Matériaux Et Réhabilitation De Structures","Université Omar Telidji de Laghouat"]
[1493,"Université_Omar_Telidji_de_Laghouat","Mathematiques Pures Et Appliques","Université Omar Telidji de Laghouat"]
[1494,"Université_Omar_Telidji_de_Laghouat","Ressources En Eau, Sols Et Environnement","Université Omar Telidji de Laghouat"]
[1495,"Université_Omar_Telidji_de_Laghouat","Semi-Conducteurs Et Matériaux Fonctionnels","Université Omar Telidji de Laghouat"]
[1496,"Université_Omar_Telidji_de_Laghouat","Counseling Psychologique Et Développement Des Outils De Mesure Dans Le Milieu Scolaire","Université Omar Telidji de Laghouat"]
[1497,"Université_Omar_Telidji_de_Laghouat","Droit Et Sciences Politique","Université Omar Telidji de Laghouat"]
[1498,"Université_Omar_Telidji_de_Laghouat","Islamiques Et Linguistiques","Université Omar Telidji de Laghouat"]
[1499,"Université_Omar_Telidji_de_Laghouat","La Santé Psychique","Université Omar Telidji de Laghouat"]
[1500,"Université_Omar_Telidji_de_Laghouat","Physico-Chimie Des Matériaux","Université Omar Telidji de Laghouat"]
[1501,"Université_Omar_Telidji_de_Laghouat","Physique Des Matériaux","Université Omar Telidji de Laghouat"]
[1502,"Université_Saad_Dahlab_de_Blida_1","Chimie Physique Moléculaire Et Macromoléculaire","Université Saad Dahlab de Blida 1"]
[1503,"Université_Saad_Dahlab_de_Blida_1","Surface, Interfaces Et Couches Minces","Université Saad Dahlab de Blida 1"]
[1504,"Université_Saad_Dahlab_de_Blida_1","Systèmes Électriques Et Télécommandes","Université Saad Dahlab de Blida 1"]
[1505,"Université_Saad_Dahlab_de_Blida_1","Traitement De Signal Et D'Imagerie","Université Saad Dahlab de Blida 1"]
[1506,"Université_Saad_Dahlab_de_Blida_1","Traitement De Surface Et Matériaux","Université Saad Dahlab de Blida 1"]
[1507,"Université_Saad_Dahlab_de_Blida_1","Structures","Université Saad Dahlab de Blida 1"]
[1508,"Université_Saad_Dahlab_de_Blida_1","Analyse Fonctionnelle Des Procédés Chimiques","Université Saad Dahlab de Blida 1"]
[1509,"Université_Saad_Dahlab_de_Blida_1","Développement Des Systèmes Informatisés","Université Saad Dahlab de Blida 1"]
[1510,"Université_Saad_Dahlab_de_Blida_1","Géomatériaux Et Génie Civil","Université Saad Dahlab de Blida 1"]
[1511,"Université_Saad_Dahlab_de_Blida_1","Applications Énergétiques De L'Hydrogène","Université Saad Dahlab de Blida 1"]
[1512,"Université_Saad_Dahlab_de_Blida_1","Biotechnologies Des Productions Végétales","Université Saad Dahlab de Blida 1"]
[1513,"Université_Saad_Dahlab_de_Blida_1","Physique Théorique & Physique De L'Interaction Rayonnement-Matière","Université Saad Dahlab de Blida 1"]
[1514,"Université_Saad_Dahlab_de_Blida_1","Génie Chimique","Université Saad Dahlab de Blida 1"]
[1515,"Université_Saad_Dahlab_de_Blida_1","Biotechnologies Liées À La Reproduction Des Animaux","Université Saad Dahlab de Blida 1"]
[1516,"Université_Saad_Dahlab_de_Blida_1","Plantes Médicinales Et Aromatiques","Université Saad Dahlab de Blida 1"]
[1517,"Université_Saad_Dahlab_de_Blida_1","Modélisation Et Développement D'Algorithme De La Recherche Opérationnelle","Université Saad Dahlab de Blida 1"]
[1518,"Université_Saad_Dahlab_de_Blida_1","Sciences Aéronautiques","Université Saad Dahlab de Blida 1"]
[1519,"Université_Saad_Dahlab_de_Blida_1","Aéronefs","Université Saad Dahlab de Blida 1"]
[1520,"Université_Saad_Dahlab_de_Blida_1","Physique Fondamentale Et Appliquée","Université Saad Dahlab de Blida 1"]
[1521,"Université_Saad_Dahlab_de_Blida_1","Cancérologie","Université Saad Dahlab de Blida 1"]
[1522,"Université_Saad_Dahlab_de_Blida_1","Détections Informations & Communications","Université Saad Dahlab de Blida 1"]
[1523,"Université_Saad_Dahlab_de_Blida_1","Eau, Environnement Et Developpement Durable","Université Saad Dahlab de Blida 1"]
[1524,"Université_Saad_Dahlab_de_Blida_1","Appareil Locomoteur Et Qualité Des Soins En Santé Publique","Université Saad Dahlab de Blida 1"]
[1525,"Université_Saad_Dahlab_de_Blida_1","Chimie Des Substances Naturelles Et De Biomolécules","Université Saad Dahlab de Blida 1"]
[1526,"Université_Saad_Dahlab_de_Blida_1","Environnement Et Technologie Pour L'Architecture Et Le Patrimoine","Université Saad Dahlab de Blida 1"]
[1527,"Université_Saad_Dahlab_de_Blida_1","Protection Et Valorisation Des Ressources Agrobiologiques","Université Saad Dahlab de Blida 1"]
[1528,"Université_Saad_Dahlab_de_Blida_1","Biotchnologies, Environnement et Santé","Université Saad Dahlab de Blida 1"]
[1529,"Université_Saad_Dahlab_de_Blida_1","Chimie Physique des Interfaces des matériaux Appliquées à L'environnement","Université Saad Dahlab de Blida 1"]
[1530,"Université_Tahar_Moulay_de_Saida","Etudes Physico-Chimiques","Université Tahar Moulay de Saida"]
[1531,"Université_Tahar_Moulay_de_Saida","Géométrie, Analyse, Contrôle Et Applications","Université Tahar Moulay de Saida"]
[1532,"Université_Tahar_Moulay_de_Saida","Modélisation Et Méthodes De Calcul","Université Tahar Moulay de Saida"]
[1533,"Université_Tahar_Moulay_de_Saida","Ressources Hydriques Et Environnement","Université Tahar Moulay de Saida"]
[1534,"Université_Tahar_Moulay_de_Saida","Mouvement De La Critique Littéraire En Algérie","Université Tahar Moulay de Saida"]
[1535,"Université_Tahar_Moulay_de_Saida","Didactique Du Français Fos","Université Tahar Moulay de Saida"]
[1536,"Université_Tahar_Moulay_de_Saida","Modèles Stochastiques, Statistiques Et Applications","Université Tahar Moulay de Saida"]
[1537,"Université_Tahar_Moulay_de_Saida","Développement Dans Les Sciences Sociales Et Sciences Humaines","Université Tahar Moulay de Saida"]
[1538,"Université_Tahar_Moulay_de_Saida","Génie Electrotechnique","Université Tahar Moulay de Saida"]
[1539,"Université_Tahar_Moulay_de_Saida","Linguistique Et Traduction","Université Tahar Moulay de Saida"]
[1540,"Université_Tahar_Moulay_de_Saida","Management Et Évaluation De Performance Des Entreprises","Université Tahar Moulay de Saida"]
[1541,"Université_Tahar_Moulay_de_Saida","Sociolinguistique Et Analyse De Discours","Université Tahar Moulay de Saida"]
[1542,"Université_Tahar_Moulay_de_Saida","Technologies Des Communications","Université Tahar Moulay de Saida"]
[1543,"Université_Tahar_Moulay_de_Saida","Gestion Des Connaissances Et Des Données Complexes","Université Tahar Moulay de Saida"]
[1544,"Université_Tahar_Moulay_de_Saida","La Protection Des Droits De Lhomme Entre Les Textes Internationaux Et Nationaux Et Leurs Effectivitès En Algèrie","Université Tahar Moulay de Saida"]
[1545,"Université_Tahar_Moulay_de_Saida","Bio toxicologie, Pharmacognosie  et valorisation biologiques des plantes  ","Université Tahar Moulay de Saida"]
[1546,"Université_Tahar_Moulay_de_Saida","Etudes juridiques comparées","Université Tahar Moulay de Saida"]
[1547,"Université_Tahar_Moulay_de_Saida","Traduction et interprétation au sein de la communication multilingue","Université Tahar Moulay de Saida"]
[1548,"Université_Tahri_Mohamed_de_Béchar","Physique Et Dispositifs Semi-Conducteurs","Université Tahri Mohamed de Béchar"]
[1549,"Université_Tahri_Mohamed_de_Béchar","Phytochimie Et Synthèse Organique","Université Tahri Mohamed de Béchar"]
[1550,"Université_Tahri_Mohamed_de_Béchar","Commande Analyse Et Optimisation Des Systémes Électro Énergétiques","Université Tahri Mohamed de Béchar"]
[1551,"Université_Tahri_Mohamed_de_Béchar","Fiabilités Des Matériaux Et Des Structures En Régions Sahariennes","Université Tahri Mohamed de Béchar"]
[1552,"Université_Tahri_Mohamed_de_Béchar","Energétique En Zones Arides","Université Tahri Mohamed de Béchar"]
[1553,"Université_Tahri_Mohamed_de_Béchar","Valorisation Des Ressources Végétales Et Sécurité Alimentaire Des Zones Semi Arides Du Sud Ouest Algérien","Université Tahri Mohamed de Béchar"]
[1554,"Université_Tahri_Mohamed_de_Béchar","Etudes Sahariennes","Université Tahri Mohamed de Béchar"]
[1555,"Université_Tahri_Mohamed_de_Béchar","Mécanique Des Structures Lms","Université Tahri Mohamed de Béchar"]
[1556,"Université_Tahri_Mohamed_de_Béchar","Mécanique: Modélisation Et Expérimentation","Université Tahri Mohamed de Béchar"]
[1557,"Université_Tahri_Mohamed_de_Béchar","Molécules Bioactives Et Séparation Chirale","Université Tahri Mohamed de Béchar"]
[1558,"Université_Tahri_Mohamed_de_Béchar","Etudes Économiques Et Développement Local Dans Le Sud Ouest","Université Tahri Mohamed de Béchar"]
[1559,"Université_Tahri_Mohamed_de_Béchar","Architecture et Patrimoine Environnemental","Université Tahri Mohamed de Béchar"]
[1560,"Université_Tahri_Mohamed_de_Béchar","Chimie et sciences de l'environnement ","Université Tahri Mohamed de Béchar"]
[1561,"Université_Tahri_Mohamed_de_Béchar","Fiabilité du Génie Mécanique ","Université Tahri Mohamed de Béchar"]
[1562,"Université_Tahri_Mohamed_de_Béchar","Réseaux Intelligents et Energies Renouvlables ","Université Tahri Mohamed de Béchar"]
[1563,"Université_Tahri_Mohamed_de_Béchar","Traitement de l'Information et Télécommunication","Université Tahri Mohamed de Béchar"]
[1564,"Université_Yahia_Farès_de_Médéa","Biomatériaux Et Phénomènes De Transport","Université Yahia Farès de Médéa"]
[1565,"Université_Yahia_Farès_de__Médéa","Procédés De Traitement Et Recyclage Des Rejets, 2003, Demande De Changement D’Intitulé À Matériaux Et Environnement Acceptée En 2010)","Université Yahia Farès de Médéa"]
[1566,"Université_Yahia_Farès_de__Médéa","Mécanique, Physique Et Modélisation Mathématique","Université Yahia Farès de Médéa"]
[1567,"Université_Yahia_Farès_de__Médéa","Didactique De La Langue Et Des Textes","Université Yahia Farès de Médéa"]
[1568,"Université_Yahia_Farès_de__Médéa","Electrotechnique Et Automatique","Université Yahia Farès de Médéa"]
[1569,"Université_Yahia_Farès_de__Médéa","Développement Local Durable","Université Yahia Farès de Médéa"]
[1570,"Université_Yahia_Farès_de__Médéa","Souveraineté Et Mondialisation","Université Yahia Farès de Médéa"]
[1571,"Université_Yahia_Farès_de__Médéa","Langue Et Art De La Communication","Université Yahia Farès de Médéa"]
[1572,"Université_Yahia_Farès_de__Médéa","Physique Des Techniques Expérimentales Et Ses Applications","Université Yahia Farès de Médéa"]
[1573,"Université_Yahia_Farès_de__Médéa","Systèmes Électroniques Avancés","Université Yahia Farès de Médéa"]
[1574,"Université_Yahia_Farès_de__Médéa","Etudes Historiques De La Méditerranée À Travers Les Âges","Université Yahia Farès de Médéa"]
[1575,"Université_Yahia_Farès_de__Médéa","Macroeconomie Et Finance International","Université Yahia Farès de Médéa"]
[1576,"Université_Ziane_Achour_de_Djelfa","Chimie Organique Et Substances Naturelles","Université Ziane Achour de Djelfa"]
[1577,"Université_Ziane_Achour_de_Djelfa","Stratégies De Prévention Et De Lutte Contre La Drogue En Algérie","Université Ziane Achour de Djelfa"]
[1578,"Université_Ziane_Achour_de_Djelfa","Corpus, Étude Et Critique Des Manuscrits De La Région Et Autre","Université Ziane Achour de Djelfa"]
[1579,"Université_Ziane_Achour_de_Djelfa","Développement En Mécanique Et Matériaux","Université Ziane Achour de Djelfa"]
[1580,"Université_Ziane_Achour_de_Djelfa","Développement, Démocratie Et Droits De L'Homme En Algérie","Université Ziane Achour de Djelfa"]
[1581,"Université_Ziane_Achour_de_Djelfa","Sciences Et Informatique Des Matériaux","Université Ziane Achour de Djelfa"]
[1582,"Université_Ziane_Achour_de_Djelfa","Terme, Manuscrit Et Littérature Algérienne Écrite Dans La Presse","Université Ziane Achour de Djelfa"]
[1583,"Université_Ziane_Achour_de_Djelfa","Droit De L’Environnement","Université Ziane Achour de Djelfa"]
[1584,"Université_Ziane_Achour_de_Djelfa","Exploration Et Valorisation Des Ecosystèmes Steppiques","Université Ziane Achour de Djelfa"]
[1585,"Université_Ziane_Achour_de_Djelfa","Automatique Appliquée Et Diagnostic Industriel","Université Ziane Achour de Djelfa"]
[1586,"Université_Ziane_Achour_de_Djelfa","Politique De Développement Rural Dans La Steppe","Université Ziane Achour de Djelfa"]
[1587,"Université_Ziane_Achour_de_Djelfa","Réformes Du Système Constitutionnel Et La Bonne Gouvernance","Université Ziane Achour de Djelfa"]
[1588,"Université_Ziane_Achour_de_Djelfa","Staps - Système Sportif En Algérie","Université Ziane Achour de Djelfa"]
[1589,"Université_Ahmed_Bougara_dit_Si_Mhamed_de_Boumerdès","Electrification Des Entreprises Industrielles","Université Ahmed Bougara dit Si Mhamed de Boumerdès"]
[1590,"Université_Ahmed_Bougara_dit_Si_Mhamed_de_Boumerdès","Fiabilité Des Équipements Pétroliers Et Matériaux","Université Ahmed Bougara dit Si Mhamed de Boumerdès"]
[1591,"Université_Ahmed_Bougara_dit_Si_Mhamed_de_Boumerdès","Génie Physique Des Hydrocarbures","Université Ahmed Bougara dit Si Mhamed de Boumerdès"]
[1592,"Université_Ahmed_Bougara_dit_Si_Mhamed_de_Boumerdès","Physique De La Terre","Université Ahmed Bougara dit Si Mhamed de Boumerdès"]
[1593,"Université_Ahmed_Bougara_dit_Si_Mhamed_de_Boumerdès","Synthèse Pétrochimique","Université Ahmed Bougara dit Si Mhamed de Boumerdès"]
[1594,"Université_Ahmed_Bougara_dit_Si_Mhamed_de_Boumerdès","Technologies Des Hydrocarbures","Université Ahmed Bougara dit Si Mhamed de Boumerdès"]
[1595,"Université_Ahmed_Bougara_dit_Si_Mhamed_de_Boumerdès","Automatique Appliquée","Université Ahmed Bougara dit Si Mhamed de Boumerdès"]
[1596,"Université_Ahmed_Bougara_dit_Si_Mhamed_de_Boumerdès","Génie Mécanique Des Solides Et Systèmes","Université Ahmed Bougara dit Si Mhamed de Boumerdès"]
[1597,"Université_Ahmed_Bougara_dit_Si_Mhamed_de_Boumerdès","Revêtement, Matériaux Et Environnement","Université Ahmed Bougara dit Si Mhamed de Boumerdès"]
[1598,"Université_Ahmed_Bougara_dit_Si_Mhamed_de_Boumerdès","Signaux Et Systèmes","Université Ahmed Bougara dit Si Mhamed de Boumerdès"]
[1599,"Université_Ahmed_Bougara_dit_Si_Mhamed_de_Boumerdès","Technologie Alimentaire","Université Ahmed Bougara dit Si Mhamed de Boumerdès"]
[1600,"Université_Ahmed_Bougara_dit_Si_Mhamed_de_Boumerdès","Traitement Et Mise En Forme Des Polymères Fibraux","Université Ahmed Bougara dit Si Mhamed de Boumerdès"]
[1601,"Université_Ahmed_Bougara_dit_Si_Mhamed_de_Boumerdès","Dynamique Des Moteurs Et Vibroacoustique","Université Ahmed Bougara dit Si Mhamed de Boumerdès"]
[1602,"Université_Ahmed_Bougara_dit_Si_Mhamed_de_Boumerdès","Ressources Minérales Et Énergétiques","Université Ahmed Bougara dit Si Mhamed de Boumerdès"]
[1603,"Université_Ahmed_Bougara_dit_Si_Mhamed_de_Boumerdès","Conservation Et Valorisation Des Ressources Biologiques","Université Ahmed Bougara dit Si Mhamed de Boumerdès"]
[1604,"Université_Ahmed_Bougara_dit_Si_Mhamed_de_Boumerdès","Energétique, Mécanique Et Ingénieries","Université Ahmed Bougara dit Si Mhamed de Boumerdès"]
[1605,"Université_Ahmed_Bougara_dit_Si_Mhamed_de_Boumerdès","Informatique, De Modélisation, D'Optimisation Et Des Systèmes Électroniques","Université Ahmed Bougara dit Si Mhamed de Boumerdès"]
[1606,"Université_Ahmed_Bougara_dit_Si_Mhamed_de_Boumerdès","Technologies Douces, Valorisation, Physico-Chimie Des Matériaux Biologiques Et Biodiversité","Université Ahmed Bougara dit Si Mhamed de Boumerdès"]
[1607,"Université_Ahmed_Bougara_dit_Si_Mhamed_de_Boumerdès","Unité De Recherche: Matériaux, Procédés Et Environnement (Remplace Le Lr 2000 \"Matériaux Minéraux Et Composites\")","Université Ahmed Bougara dit Si Mhamed de Boumerdès"]
[1608,"Université_Ahmed_Bougara_dit_Si_Mhamed_de_Boumerdès","L’Avenir De L’Économie Algérien Hors Les Hydrocarbures","Université Ahmed Bougara dit Si Mhamed de Boumerdès"]
[1609,"Université_Ahmed_Bougara_dit_Si_Mhamed_de_Boumerdès","Performance Des Entreprises Économiques Algériennes Dans Le Cadre De La Dynamique Économique Internationale","Université Ahmed Bougara dit Si Mhamed de Boumerdès"]
[1610,"Université_Ahmed_Bougara_dit_Si_Mhamed_de_Boumerdès","Etudes Politiques Et Internationales","Université Ahmed Bougara dit Si Mhamed de Boumerdès"]
[1611]
[1612,null,"Etablissement  de Global"]
[1613,null,"*** Universités ***"]
[1614,null,"U. Adrar"]
[1615,null,"U. Alger-1-"]
[1616,null,"U. Alger-2-"]
[1617,null,"U. Alger-3-"]
[1618,null,"U. Annaba"]
[1619,null,"U. Batna-1-"]
[1620,null,"U. Batna-2-"]
[1621,null,"U. Béchar"]
[1622,null,"U. Bejaia"]
[1623,null,"U. Biskra"]
[1624,null,"U. Blida-1-"]
[1625,null,"U. Blida-2-"]
[1626,null,"U. Bordj Bou Arreridj"]
[1627,null,"U. Bouira"]
[1628,null,"U. Boumerdès"]
[1629,null,"U. Chlef"]
[1630,null,"U. Constantine-1-"]
[1631,null,"U. Constantine-2-"]
[1632,null,"U. Constantine-3-"]
[1633,null,"U. Djelfa"]
[1634,null,"U. El Oued"]
[1635,null,"U. Formation Continue"]
[1636,null,"U. Ghardaia"]
[1637,null,"U. Guelma"]
[1638,null,"U. Jijel"]
[1639,null,"U. Khemis Miliana"]
[1640,null,"U. Khenchela"]
[1641,null,"U. Laghouat"]
[1642,null,"U. Mascara"]
[1643,null,"U. Médéa"]
[1644,null,"U. Mostaganem"]
[1645,null,"U. M'sila"]
[1646,null,"U. Oran-1-"]
[1647,null,"U. Oran-2-"]
[1648,null,"U. Ouargla"]
[1649,null,"U. Oum El Bouaghi"]
[1650,null,"U. Saida"]
[1651,null,"U. Sc. Islamiques Constantine"]
[1652,null,"U. Sétif-1-"]
[1653,null,"U. Sétif-2-"]
[1654,null,"U. Sidi Bel Abbès"]
[1655,null,"U. Skikda"]
[1656,null,"U. Souk Ahras"]
[1657,null,"U. STHB"]
[1658,null,"U. STO"]
[1659,null,"U. Tarf"]
[1660,null,"U. Tébessa"]
[1661,null,"U. Tiaret"]
[1662,null,"U. Tizi Ouzou"]
[1663,null,"U. Tlemcen"]
[1664,null,"*** Ecoles Nationales Supérieures ***"]
[1665,null,"ENS-TP ex ENTP"]
[1666,null,"ENP Harrach"]
[1667,null,"ENS-Agro. ex INA"]
[1668,null,"ENS-SCF ex ESC"]
[1669,null,"ENS-SEA ex INPS"]
[1670,null,"ENS-Archit. ex EPAU"]
[1671,null,"ENS-Vétérinaires"]
[1672,null,"ENS-H Blida"]
[1673,null,"ESI ex-INI"]
[1674,null,"ESI Sidi Bel Abbès"]
[1675,null,"EHEC"]
[1676,null,"ENP Oran ex Enset"]
[1677,null,"ENS-Management"]
[1678,null,"ENSSMAL"]
[1679,null,"ENST"]
[1680,null,"ENS-JSI"]
[1681,null,"ENSSP"]
[1682,null,"ENS-Mine & Métallugie"]
[1683,null,"ENP Constantine"]
[1684,null,"ENS-Biotechnologie"]
[1685,null,"*** Ecoles Normales Supérieures ***"]
[1686,null,"Ens Kouba"]
[1687,null,"Ens Constantine"]
[1688,null,"Ens Bouzaréah"]
[1689,null,"Ens Laghouat"]
[1690,null,"Ens Skikda"]
[1691,null,"Ens Béchar"]
[1692,null,"Ens sétif"]
[1693,null,"Ens Bou Saâda"]
[1694,null,"Ens Ouargla"]
[1695,null,"Ens Mostaganem"]
[1696,null,"Ens Oran"]
[1697,null,"*** Ecoles Préparatoires ***"]
[1698,null,"EPSc.N&V Alger","2. Ecole préparatoire en sciences de la nature et de la vie à Alger"]
[1699,null,"EPST Alger","3. Ecole préparatoire en sciences et techniques à Alger"]
[1700,null,"EPSE Alger","1. Ecole préparatoire en sciences économiques, commerciales et sciences de gestion à Alger"]
[1701,null,"EPST Annaba","1. Ecole préparatoire en sciences et techniques à Annaba"]
[1702,null,"EPST Oran","4. Ecole préparatoire en sciences et techniques à Oran"]
[1703,null,"EPST Tlemcen"," Ecole préparatoire en sciences et techniques à Tlemcen"]
[1704,null,"EPSE Annaba","3. Ecole préparatoire en sciences économiques, commerciales et sciences de gestion à Annaba"]
[1705,null,"EPSE Constantine","2. Ecole préparatoire en sciences économiques, commerciales et sciences de gestion à Constantine"]
[1706,null,"EPSE Oran","2. Ecole préparatoire en sciences économiques, commerciales et sciences de gestion à Oran"]
[1707,null,"EPSE Tlemcen","3. Ecole préparatoire en sciences économiques, commerciales et sciences de gestion à Tlemcen"]
[1708,null,"EPSc.N&V Mostaganem","5. Ecole Préparatoire en sciences de la nature et de la vie de Mostaganem"]
[1709,null,"EPSc.N&V Oran","6.  Ecole Préparatoire en sciences de la nature et de la vie d'Oran"]
[1710,null,"*** Centres Universitaires ***"]
[1711,null,"CU. Tamanrasset","1. Centre universitaire Amin Eloukkal El Hadj Moussa Ag Akhamouk de Tamanrasset"]
[1712,null,"CU. Ain Temouchent","2. Centre Universitaire Belhadj Bouchaib de Aïn Témouchent"]
[1713,null,"CU. Mila","1.  Centre Universitaire Abdelhafid Boussouf de Mila"]
[1714,null,"CU. Rélizane","3. Centre universitaire Ahmed Zabana de Rélizane"]
[1715,null,"CU. Tissemsilt","1. Centre Universitaire de Tissemsilt"]
[1716,null,"CU. Naâma","4. Centre universitaire Salhi Ahmed dit Ali de Naama"]
[1717,null,"CU. El Bayadh","5. Centre universitaire  Nour Elbachir d'El Bayadh"]
[1718,null,"CU. Tindouf","6. Centre universitaire de Tindouf"]
[1719,null,"CU. Tipasa","2. Centre universitaire Morsli Abdellah de Tipaza"]
[1720,null,"CU. Illizi","3. Centre Universitaire d'Illizi"]
[1721,null,"CU. Maghnia","7. Centre universitaire de Maghnia"]
[1722,null,"*** Centres de recherche MESRS ***"]
[1723,null,"CERIST"]
[1724,null,"CREAD"]
[1725,null,"CDER"]
[1726,null,"CDTA"]
[1727,null,"CRSTDLA"]
[1728,null,"CRSTRA"]
[1729,null,"CRASC"]
[1730,null,"CRAPC"]
[1731,null,"CSC"]
[1732,null,"CRB. Constantine"]
[1733,null,"CRTSE"]
[1734,null,"*** Centres de recherche HORS MESRS ***"]
[1735,null,"CETIM"]
[1736,null,"CREM"]
[1737,null,"CRAAG"]
[1738,null,"CRNA"]
[1739,null,"CRNB"]
[1740,null,"CRND"]
[1741,null,"CRNT"]
[1742,null,"CNERIB"]
[1743,null,"CENAP"]
[1744,null,"CGS"]
[1745,null,"CNRA"]
[1746,null,"CNRPAH "]
[1747,null,"CNRDPA"]
[1748,null,"CNTS"]
[1749,null,"CNERMN54"]
[1750,null,"INFS/STS DelyBrahim"]
[1751,null,"IS Maritime Bousmail"]
[1752,null,"INPTIC"]
[1753,null,"INRF"]
[1754,null,"INRAA"]
[1755,null,"INRE"]
[1756,null,"INTTIC Oran ex-ITO"]
[1757,null,"Institut Pasteur"]
[1758,null,"*** Agences de Recherche ***"]
[1759,null,"ATRSS"]
[1760,null,"ATRST"]
[1761,null,"ANVREDET"]
[1762,null,"ATRSNV"]
[1763,null,"ATRSSH"]
[1764,null,"ATBSA"]
[1765,null,"***Autres renseigner ds l'observation***"]
[1766]
[1767]
[1768]
[1769]
[1770]
[1771]
[1772]
[1773]
[1774]
[1775]
[1776]
[1777]
[1778]
[1779]
[1780]
[1781]
[1782]
[1783]
[1784]
[1785]
[1786]
[1787]
[1788]
[1789]
[1790]
[1791]
[1792]
[1793]
[1794]
[1795]
[1796]
[1797]
[1798]
[1799]
[1800]
[1801]
[1802]
[1803]
[1804]
[1805]
[1806]
[1807]
[1808]
[1809]
[1810]
[1811]
[1812]
[1813]
[1814]
[1815]
[1816]
[1817]
[1818]
[1819]
[1820]
[1821]
[1822]
[1823]
[1824]
[1825]
[1826]
[1827]
[1828]
[1829]
[1830]
[1831]
[1832]
[1833]
[1834]
[1835]
[1836]
[1837]
[1838]
[1839]
[1840]
[1841]
[1842]
[1843]
[1844]
[1845]
[1846]
[1847]
[1848]
[1849]
[1850]
[1851]
[1852]
[1853]
[1854]
[1855]
[1856]
[1857]
[1858]
[1859]
[1860]
[1861]
[1862]
[1863]
[1864]
[1865]
[1866]
[1867]
[1868]
[1869]
[1870]
[1871]
[1872]
[1873]
[1874]
[1875]
[1876]
[1877]
[1878]
[1879]
[1880]
[1881]
[1882]
[1883]
[1884]
[1885]
[1886]
[1887]
[1888]
[1889]
[1890]
[1891]
[1892]
[1893]
[1894]
[1895]
[1896]
[1897]
[1898]
[1899]
[1900]
[1901]
[1902]
[1903]
[1904]
[1905]
[1906]
[1907]
[1908]
[1909]
[1910]
[1911]
[1912]
[1913]
[1914]
[1915]
[1916]
[1917]
[1918]
[1919]
[1920]
[1921]
[1922]
[1923]
[1924]
[1925]
[1926]
[1927]
[1928]
[1929]
[1930]
[1931]
[1932]
[1933]
[1934]
[1935]
[1936]
[1937]
[1938]
[1939]
[1940]
[1941]
[1942]
[1943]
[1944]
[1945]
[1946]
[1947]
[1948]
[1949]
[1950]
[1951]
[1952]
[1953]
[1954]
[1955]
[1956]
[1957]
[1958]
[1959]
[1960]
[1961]
[1962]
[1963]
[1964]
[1965]
[1966]
[1967]
[1968]
[1969]
[1970]
[1971]
[1972]
[1973]
[1974]
[1975]
[1976]
[1977]
[1978]
[1979]
[1980]
[1981]
[1982]
[1983]
[1984]
[1985]
[1986]
[1987]
[1988]
[1989]
[1990]
[1991]
[1992]
[1993]
[1994]
[1995]
[1996]
[1997]
[1998]
[1999]
[2000]